﻿[
  {
    "SummaryElementID": "COM",
    "BAC_Dollars": 7482006.764033,
    "BCWS_CumulativeToDate_Dollars": 92776.843218,
    "ReprogBA_Dollars": 0.0,
    "ReprogCVA_Dollars": 0.0,
    "ReprogSVA_Dollars": 0.0
  },
  {
    "SummaryElementID": "GA",
    "BAC_Dollars": 545500579.028745,
    "BCWS_CumulativeToDate_Dollars": 3722438.228938,
    "ReprogBA_Dollars": 0.0,
    "ReprogCVA_Dollars": 0.0,
    "ReprogSVA_Dollars": 0.0
  },
  {
    "SummaryElementID": "OH",
    "BAC_Dollars": 1051798281.066536,
    "BCWS_CumulativeToDate_Dollars": 7329137.455515,
    "ReprogBA_Dollars": 0.0,
    "ReprogCVA_Dollars": 0.0,
    "ReprogSVA_Dollars": 0.0
  },
  {
    "SummaryElementID": "UB",
    "ACWP_CumulativeToDate_Dollars": 0.0,
    "BAC_Dollars": 0.000000,
    "BCWP_CumulativeToDate_Dollars": 0.0,
    "BCWS_CumulativeToDate_Dollars": 0.0,
    "EAC_Dollars": 0.000000,
    "ReprogBA_Dollars": 0.0,
    "ReprogCVA_Dollars": 0.0,
    "ReprogSVA_Dollars": 0.0
  },
  {
    "SummaryElementID": "MR",
    "ACWP_CumulativeToDate_Dollars": 0.0,
    "BAC_Dollars": 0.000000,
    "BCWP_CumulativeToDate_Dollars": 0.0,
    "BCWS_CumulativeToDate_Dollars": 0.0,
    "EAC_Dollars": 0.0,
    "ReprogBA_Dollars": 0.0,
    "ReprogCVA_Dollars": 0.0,
    "ReprogSVA_Dollars": 0.0
  },
  {
    "SummaryElementID": "PMB",
    "ACWP_CumulativeToDate_Dollars": 0.0,
    "ACWP_CumulativeToDate_Hours": 0.0,
    "BAC_Dollars": 3661517810.634250,
    "BAC_Hours": 15327498.061249,
    "BCWP_CumulativeToDate_Dollars": 0.0,
    "BCWP_CumulativeToDate_Hours": 0.0,
    "BCWS_CumulativeToDate_Dollars": 56556063.371589,
    "BCWS_CumulativeToDate_Hours": 110625.003921,
    "EAC_Dollars": 0.000000,
    "EAC_Hours": 0.0,
    "ReprogBA_Dollars": 0.0,
    "ReprogBA_Hours": 0.0,
    "ReprogCVA_Dollars": 0.0,
    "ReprogCVA_Hours": 0.0,
    "ReprogSVA_Dollars": 0.0,
    "ReprogSVA_Hours": 0.0
  }
]