﻿{
  "Data_SoftwareName": "Acumen Fuse",
  "Data_SoftwareVersion": "8.6.706.1",
  "Data_SoftwareCompanyName": "Deltek",
  "Data_SoftwareComments": "ScheduleSource=Oracle Primavera P6;CostSource=",
  "Export_SoftwareName": "PPM.CommonData",
  "Export_SoftwareVersion": "2.1.4.16",
  "Export_SoftwareCompanyName": "Deltek, Inc."
}