Name,Sex,Age,Division,Equipment,BodyweightKg,WeightClassKg,Squat1Kg,Squat2Kg,Squat3Kg,Best3SquatKg,Bench1Kg,Bench2Kg,Bench3Kg,Best3BenchKg,Deadlift1Kg,Deadlift2Kg,Deadlift3Kg,Best3DeadliftKg,TotalKg,Event,Place,Country
Daniela Ordaz,F,,Teen 15-19,Single-ply,59.9,60,50,60,-65,60,30,-35,35,35,60,70,-75,70,165,SBD,1,Mexico
Ana Gonsalez,F,,Open,Single-ply,47.9,48,115,-120,-120,115,60,65,-70,65,120,135,-137.5,135,315,SBD,1,Mexico
Raquel Porras,F,,Open,Single-ply,52,52,90,100,-110,100,70,80,-85,80,100,115,-131,115,295,SBD,1,Mexico
Tara Williams,F,,Open,Single-ply,67.5,67.5,-130,-130,130,130,60,65,70,70,130,140,145,145,345,SBD,1,Ireland
Martha Rodriguez,F,,Open,Single-ply,62.4,67.5,115,125,-135,125,40,55,65,65,130,140,-150,140,330,SBD,2,Mexico
Alejandra Matus,F,,Open,Single-ply,75,75,-170,170,-190,170,70,75,-80,75,190,201,205,205,450,SBD,1,Mexico
Nicole Güldner,F,,Open,Single-ply,79.4,82.5,-180,-180,,,,,,,,,,,,SBD,DQ,Germany
Heike Schattmann,F,,Open,Single-ply,86.6,90,-175,-185,185,185,115,122.5,-135,122.5,160,180,-200,180,487.5,SBD,1,Germany
Lucy Kruger,F,,Masters 40-44,Single-ply,68.7,75,-110,-115,-115,,,,,,,,,,,SBD,DQ,Germany
Ursula Eschenasy,F,,Masters 45-49,Single-ply,55.4,56,90,-100,-100,90,45,50,52.5,52.5,90,100,-110,100,242.5,SBD,1,Germany
Lynda Chattacombe,F,,Masters 45-49,Single-ply,58.1,60,-130,130,140,140,60,65,70,70,130,150,160,160,370,SBD,1,England
Arnold Steinbrecher,M,,Teen 15-19,Single-ply,36.3,56,50,55,57.5,57.5,32.5,35,37.5,37.5,80,85,-90,85,180,SBD,1,Germany
Sebastian Eschenasy,M,,Teen 15-19,Single-ply,37.4,56,45,-55,60,60,25,-30,-30,25,45,65,-70,65,150,SBD,2,Germany
Heriberto Valdivia,M,,Teen 15-19,Single-ply,61.8,67.5,-150,-161,161,161,-90,95,-106,95,161,180,200,200,456,SBD,1,Mexico
Guido Wilhem,M,,Open,Single-ply,58.2,60,180,-195,-195,180,100,110,117.5,117.5,200,210,-216,210,507.5,SBD,1,Mexico
David Orth,M,,Teen 15-19,Single-ply,78.2,82.5,130,140,-150,140,100,105,-110,105,130,145,155,155,400,SBD,1,Germany
Daniel Persch,M,,Juniors 20-23,Single-ply,65.4,67.5,125,137.5,142.5,142.5,75,85,87.5,87.5,135,145,155,155,385,SBD,1,Germany
Anne van Baaren,F,,Juniors 20-23,Single-ply,71.3,75,200,-220,220,220,120,125,130,130,-190,190,-215,190,540,SBD,1,Netherlands
Daniele van de Berg,F,,Juniors 20-23,Single-ply,78.6,82.5,180,-200,200,200,125,132.5,-140,132.5,180,195,-205,195,527.5,SBD,2,Netherlands
David Muñoz,M,,Juniors 20-23,Single-ply,78.6,82.5,155,170,-180,170,105,120,-125,120,175,190,-202.5,190,480,SBD,3,Mexico
Andreas Bracht,M,,Juniors 20-23,Single-ply,80.1,82.5,-230,230,-245,230,-150,150,160,160,220,240,250,250,640,SBD,1,Germany
Dirk Schumann,M,,Open,Single-ply,67,67.5,180,187.5,-195,187.5,117.5,-122.5,-122.5,117.5,-195,195,200,200,505,SBD,2,Germany
Frank Binger,M,,Open,Single-ply,64.7,67.5,165,177.5,-182.5,177.5,107.5,112.5,-115,112.5,200,-210,,200,490,SBD,3,Germany
Jorge Ortega,M,,Open,Single-ply,67.5,67.5,220,245,-250,245,135,-142.5,142.5,142.5,225,235,-245,235,622.5,SBD,1,Mexico
Mario Hernandez,M,,Open,Single-ply,74.5,75,235,-245,245,245,135,-145,145,145,210,220,-230,220,610,SBD,1,Mexico
Bernd Large,M,,Masters 40-44,Single-ply,75,75,165,180,185,185,115,120,125,125,165,182.5,-190,182.5,492.5,SBD,1,Germany
Maurice Green,M,,Masters 45-49,Single-ply,74.1,75,190,220,-236,220,-135,135,140,140,210,230,-240,230,590,SBD,1,England
Calin Eschenasy,M,,Masters 50-54,Single-ply,74.2,75,-170,170,-202.5,170,80,100,,100,180,210,-223,210,480,SBD,1,Germany
Paul Murphy #1,M,,Open,Single-ply,81,82.5,280,305.5,315,315,150,157.5,162.5,162.5,270,285,-295,285,762.5,SBD,1,England
Wolfgang Haider,M,,Open,Single-ply,79.1,82.5,240,257.5,265,265,140,150,-160,150,240,255,-262.5,255,670,SBD,3,Austria
Shane Brodie,M,,Open,Single-ply,82.3,82.5,260,280,300,300,165,172.4,177.5,177.5,265,275,-280,275,752.5,SBD,2,Ireland
Saul Balderrama,M,,Open,Single-ply,82.4,82.5,225,235,-245,235,150,-160,-160,150,200,-230,,200,585,SBD,4,Mexico
Michael Eschle,M,,Open,Single-ply,89.5,90,220,230,-240,230,140,150,-160,150,220,235,-245,235,615,SBD,5,Germany
Bernard Delaney,M,,Open,Single-ply,90,90,275,295,305,305,212.5,222.5,-227.5,222.5,290,300,305,305,832.5,SBD,1,Ireland
Elio Taurisano,M,,Open,Single-ply,88.9,90,240,252.5,-260,252.5,150,160,165,165,255,275,-282.5,275,692.5,SBD,4,Germany
Javier Sostres,M,,Open,Single-ply,90,90,270,290,300,300,170,185,-195,185,260,275,-300,275,760,SBD,3,Mexico
Oswaldo Aguirre,M,,Open,Single-ply,89.8,90,292.5,302.5,-307.5,302.5,195,202.5,210,210,275,300,,300,812.5,SBD,2,Mexico
Andrew Shipman,M,,Masters 40-44,Single-ply,80.9,82.5,-215,-215,215,215,145,152.5,-157.5,152.5,215,235,245,245,612.5,SBD,1,England
James Butler #3,M,,Masters 40-44,Single-ply,81.8,82.5,-230,-230,230,230,-120,120,,120,160,200,-255,200,550,SBD,2,Ireland
Victor Gomez,M,,Masters 45-49,Single-ply,82.5,82.5,-275,-275,275,275,165,175,185,185,265,280,290,290,750,SBD,1,Mexico
Coert Hoppenbrouwers,M,,Masters 45-49,Single-ply,82.7,90,230,255,-265,255,150,162.5,167.5,167.5,245,265,-277.5,265,687.5,SBD,1,Netherlands
Bernd Steinbrecher,M,,Masters 50-54,Single-ply,77.8,82.5,-195,200,205,205,120,125,130,130,210,-215,,210,545,SBD,1,Germany
Thomas Dillon,M,,Masters 60-64,Single-ply,80.7,82.5,120,,,120,120,132.5,,132.5,200,215,232.5,232.5,485,SBD,1,Ireland
Michael Domaradzki,M,,Masters 65-69,Single-ply,70.2,75,70,-80,85,85,80,-90,90,90,120,130,-135,130,305,SBD,1,Poland
Kyle Young #4,M,,Teen 15-19,Single-ply,90.8,100,170,180,-190,180,110,-115.5,117.5,117.5,200,210,220,220,517.5,SBD,1,England
Alexander Mittag,M,,Juniors 20-23,Single-ply,95.7,100,225,-235,-235,225,125,135,147.5,147.5,210,237.5,252.5,252.5,625,SBD,1,Germany
Chris Wall,M,,Juniors 20-23,Single-ply,96.6,100,225,245,-257.5,245,130,140,-147.5,140,220,230,240,240,625,SBD,2,England
Craig Coombes,M,,Open,Single-ply,99.6,100,-335,367.5,-385,367.5,220,235,241,241,290,-305,-305,290,898.5,SBD,1,England
Jens Sobotka,M,,Open,Single-ply,98.7,100,250,265,275,275,145,155,-160,155,260,270,282.5,282.5,712.5,SBD,2,Germany
Pierre Roy,M,,Open,Single-ply,94.9,100,-235,245,260,260,190,-200,-200,190,230,250,-262.5,250,700,SBD,3,Germany
Dean Drury,M,,Masters 40-44,Single-ply,84.8,90,-265,265,290,290,160,172.5,-180.5,172.5,265,-283.5,283.5,283.5,746,SBD,1,England
Frank Schmidlmann,M,,Masters 40-44,Single-ply,87.4,90,225,235,240,240,125,135,-145,135,240,255,265,265,640,SBD,2,Germany
Jorge Pinera,M,,Masters 40-44,Single-ply,90,90,180,210,230,230,120,135,-150,135,200,240,-270,240,605,SBD,3,Mexico
Nicholas Geraint,M,,Masters 40-44,Single-ply,98.9,100,245,260,-272.5,260,142.5,-150,155,155,255,272.5,-305,272.5,687.5,SBD,2,England
Walter Becka,M,,Masters 40-44,Single-ply,96.4,100,-160,-160,-160,,,,,,,,,,,SBD,DQ,Austria
Peter Malfa,M,,Masters 40-44,Single-ply,94.5,100,-260,260,275,275,150,157.5,160,160,265,275,282.5,282.5,717.5,SBD,1,Germany
David Belcher,M,,Masters 45-49,Single-ply,100,100,200,-220,-220,200,125,130,140,140,220,240,250,250,590,SBD,1,England
Peter Berghmans,M,,Masters 50-54,Single-ply,93.4,100,-215,215,230,230,125,-132.5,-132.5,125,220,230,-245,230,585,SBD,1,Netherlands
Juan Antonio Salazar,M,,Juniors 20-23,Single-ply,108.3,110,285,312.5,-325,312.5,-170,185,192.5,192.5,250,285,295,295,800,SBD,2,Mexico
Keith Ellis,M,,Juniors 20-23,Single-ply,105.5,110,280,300,315.5,315.5,170,180,-187.5,180,260,285,305,305,800.5,SBD,1,England
David Squires,M,,Open,Single-ply,108.9,110,335,350,-370,350,-227.5,-227.5,-227.5,,,,,,,SBD,DQ,England
Carlos Matus,M,,Open,Single-ply,107.5,110,-285,285,305,305,165,175,185,185,240,260,-280,260,750,SBD,1,Mexico
Carlos Quintana,M,,Open,Single-ply,106.8,110,-270,-270,,,,,,,,,,,,SBD,DQ,Mexico
Fransisco Gomez,M,,Masters 40-44,Single-ply,109.8,110,230,265,-280,265,110,120,-130,120,240,-286.5,-286.5,240,625,SBD,1,Mexico
Jose Avila,M,,Masters 40-44,Single-ply,106.3,110,215,-225,-225,215,140,160,-200,160,200,220,230,230,605,SBD,2,Mexico
Richard West,M,,Masters 45-49,Single-ply,108.5,110,220,-250,-250,220,165,175,-185.5,175,220,240,-260.5,240,635,SBD,1,England
Robert Campbell #4,M,,Masters 55-59,Single-ply,107.2,110,250,262.5,272.5,272.5,150,-167.5,167.5,167.5,250,262.5,-272.5,262.5,702.5,SBD,1,England
Fransisco Gomez Jr,M,,Teen 15-19,Single-ply,110.1,125,195,220,-235,220,95,101,-110,101,180,195,-205,195,516,SBD,1,Mexico
Damian Lapacz,M,,Juniors 20-23,Single-ply,111.8,125,270,-295,-300,270,150,170,-180,170,240,260,-280,260,700,SBD,1,Germany
Rubén Hernández #2,M,,Open,Single-ply,113.2,125,220,250,-280,250,-150,150,-170,150,220,240,-260,240,640,SBD,3,Mexico
Oliver Türk,M,,Open,Single-ply,123.4,125,335,-350,-350,335,240,-250,250,250,280,300,305,305,890,SBD,1,Germany
Eric Hashnel,M,,Open,Single-ply,117.9,125,340,-370,-385,340,-205,205,,205,300,315,-345,315,860,SBD,2,Germany
Alvaro Alvarez Martinez,M,,Open,Single-ply,129.2,140,280,300,-315,300,210,220,225,225,200,240,257.5,257.5,782.5,SBD,1,Mexico
Jans Pollex,M,,Open,Single-ply,125.4,140,280,300,-305,300,180,190,200,200,260,280,-285,280,780,SBD,2,Germany
Greg Ashford,M,,Open,Single-ply,125.7,140,260,280,-300,280,190,200,205,205,260,280,-302.5,280,765,SBD,3,England
Ed Fennema,M,,Masters 40-44,Single-ply,121.2,125,300,-315,320,320,180,-200,200,200,260,280,-300,280,800,SBD,2,Netherlands
Jaap Fahner,M,,Masters 40-44,Single-ply,121.9,125,300,-325,,300,200,210,-220,210,300,310,320,320,830,SBD,1,Netherlands
Charlie Evans,M,,Masters 40-44,Single-ply,127.1,140,250,275,-300,275,170,180.5,187.5,187.5,220,240,265,265,727.5,SBD,1,England
Colin Yemm,M,,Masters 40-44,Single-ply,127.6,140,-290,-290,-300,,,,,,,,,,,SBD,DQ,England
Richard Fricker,M,,Masters 40-44,Single-ply,156.9,140+,275,315,337.5,337.5,175,190,-202.5,190,255,-295,-295,255,782.5,SBD,1,England
Gerhard Holleithner,M,,Masters 45-49,Single-ply,125.2,140,-230,230,,230,-210,210,-240,210,300,-325,,300,740,SBD,1,Austria
David Carter #1,M,,Masters 55-59,Single-ply,133.7,140,302.5,322.5,342.5,342.5,170,183,187.5,187.5,307.5,-332.5,,307.5,837.5,SBD,1,England
Daniela Ordaz,F,,Teen 15-19,Single-ply,59.6,60,,,,,30,35,-36,35,,,,,35,B,1,Mexico
Adriana Bialostocki,F,,Juniors 20-23,Single-ply,82,82.5,,,,,75,-85,-85,75,,,,,75,B,1,Germany
Jenifer Hesse,F,,Teen 15-19,Single-ply,84.5,90,,,,,65,-75,-77.5,65,,,,,65,B,1,Germany
Raquel Porras,F,,Open,Single-ply,51.5,52,,,,,70,80,82.5,82.5,,,,,82.5,B,1,Mexico
Isabel Riede,F,,Open,Single-ply,58.1,60,,,,,-70,70,77.5,77.5,,,,,77.5,B,1,Germany
Claudia Rios,F,,Open,Single-ply,64,67.5,,,,,65,67.5,-70,67.5,,,,,67.5,B,1,Mexico
Britta Schmitt,F,,Masters 40-44,Single-ply,56.6,60,,,,,50,53,54,54,,,,,54,B,1,Germany
Mateosz Wilkowski,M,,Teen 15-19,Single-ply,65.9,67.5,,,,,80,-90,,80,,,,,80,B,1,Poland
Krzysctof Hejna,M,,Teen 15-19,Single-ply,65.5,67.5,,,,,-90,-95,,,,,,,,B,DQ,Poland
Andrzej Jakubowski,M,,Teen 15-19,Single-ply,73.9,75,,,,,110,120,-125,120,,,,,120,B,2,Poland
Sergej Erdmann,M,,Teen 15-19,Single-ply,71.5,75,,,,,-140,-140,140,140,,,,,140,B,1,Germany
Andreas Hartung,M,,Juniors 20-23,Single-ply,69.1,75,,,,,120,125,-130,125,,,,,125,B,1,Germany
Andrea Werner,M,,Masters 55-59,Single-ply,68.8,75,,,,,-70,70,-75,70,,,,,70,B,1,Italy
Werner Muller,M,,Masters 70-74,Single-ply,73.3,75,,,,,95,-100,-100,95,,,,,95,B,1,Germany
Mario Purkarthofer,M,,Juniors 20-23,Single-ply,82.3,82.5,,,,,120,-130,130,130,,,,,130,B,1,Austria
Waldemar Sager,M,,Juniors 20-23,Single-ply,84.7,90,,,,,185,-190,190,190,,,,,190,B,1,Germany
Lucas Gijsbertsen,M,,Open,Single-ply,66.4,67.5,,,,,160,-170,170,170,,,,,170,B,1,Netherlands
Engin Sinar,M,,Open,Single-ply,67.4,67.5,,,,,132.5,142.5,-150,142.5,,,,,142.5,B,2,Germany
Jorge Ortega,M,,Open,Single-ply,67.4,67.5,,,,,135,-142.5,142.5,142.5,,,,,142.5,B,2,Mexico
Marcello Facciponte,M,,Open,Single-ply,69.3,75,,,,,140,142.5,147.5,147.5,,,,,147.5,B,1,Italy
Nico Hellwig,M,,Open,Single-ply,81.3,82.5,,,,,125,130,-135,130,,,,,130,B,5,Germany
Saul Balderrama,M,,Open,Single-ply,81.9,82.5,,,,,155,-162.5,-162.5,155,,,,,155,B,3,Mexico
Peter Wissel,M,,Masters 40-44,Single-ply,74.3,75,,,,,-130,130,132.5,132.5,,,,,132.5,B,1,Germany
Uwe Sieg,M,,Masters 45-49,Single-ply,67,67.5,,,,,135,140,-150,140,,,,,140,B,1,Germany
Salih Meryem,M,,Masters 45-49,Single-ply,70,75,,,,,90,95,97.5,97.5,,,,,97.5,B,1,Germany
Alfredo Garcia,M,,Masters 60-64,Single-ply,72,75,,,,,-87.5,87.5,100,100,,,,,100,B,2,Mexico
Mauro Mastrapasqua,M,,Masters 60-64,Single-ply,74.6,75,,,,,142.5,-147.5,147.5,147.5,,,,,147.5,B,1,Italy
Michael Domaradzki,M,,Masters 65-69,Single-ply,69.6,75,,,,,85,-92.5,-92.5,85,,,,,85,B,1,Poland
Jurgen Lang,M,,Open,Single-ply,79.9,82.5,,,,,160,167.5,-170,167.5,,,,,167.5,B,2,Germany
Eugen Gretz,M,,Open,Single-ply,82.5,82.5,,,,,135,-140,-140,135,,,,,135,B,4,Germany
Paul Kraft,M,,Open,Single-ply,78.2,82.5,,,,,180,-190,-190,180,,,,,180,B,1,Germany
Thomas Dillon,M,,Masters 60-64,Single-ply,80.8,82.5,,,,,-140,147.5,150,150,,,,,150,B,1,Ireland
Vito Pappalettera,M,,Open,Single-ply,85.7,90,,,,,-140,140,150,150,,,,,150,B,4,Italy
Oswaldo Aguirre,M,,Open,Single-ply,89.1,90,,,,,-195,-195,195,195,,,,,195,B,1,Mexico
Javier Sostres,M,,Open,Single-ply,90,90,,,,,180,-190,-197.5,180,,,,,180,B,2,Mexico
Jörg Rödiger,M,,Open,Single-ply,84.1,90,,,,,-145,152.5,-157.5,152.5,,,,,152.5,B,3,Germany
Phil Beniston,M,,Masters 40-44,Single-ply,86.7,90,,,,,170,182.5,190,190,,,,,190,B,1,England
Robert Bock,M,,Open,Single-ply,98.9,100,,,,,145,155,165,165,,,,,165,B,3,Austria
Artur Hammerschmidt,M,,Open,Single-ply,96.1,100,,,,,-220,220,230,230,,,,,230,B,1,Germany
Pierre Roy,M,,Open,Single-ply,96.2,100,,,,,195,200,,200,,,,,200,B,2,Germany
Thomas Lorenz,M,,Open,Single-ply,95.9,100,,,,,150,-155,157.5,157.5,,,,,157.5,B,4,Germany
Isaac Torres,M,,Masters 50-54,Single-ply,94.4,100,,,,,-150,150,-160,150,,,,,150,B,2,Mexico
Peter Berghmans,M,,Masters 50-54,Single-ply,92.5,100,,,,,-135,-135,-135,,,,,,,B,DQ,Netherlands
Fred Riede,M,,Masters 50-54,Single-ply,98.7,100,,,,,200,215,220,220,,,,,220,B,1,Germany
Lothar Hildebrandt,M,,Masters 60-64,Single-ply,97,100,,,,,-137.5,137.5,-142.5,137.5,,,,,137.5,B,1,Germany
Patrick Hofmann,M,,Open,Single-ply,100.3,110,,,,,180,-190,190,190,,,,,190,B,4,Austria
Jurgen Geibler,M,,Open,Single-ply,103.1,110,,,,,215,-220,-220,215,,,,,215,B,1,Germany
Viktor Wagner,M,,Open,Single-ply,108.3,110,,,,,-190,195,-202.5,195,,,,,195,B,3,Germany
Cosimo Ferrucci,M,,Open,Single-ply,107.4,110,,,,,200,210,-220,210,,,,,210,B,2,Italy
Tony Brown,M,,Masters 40-44,Single-ply,102.1,110,,,,,-231,-235,235,235,,,,,235,B,1,England
Juri Hochstetter,M,,Masters 40-44,Single-ply,109.6,110,,,,,-240,-240,-240,,,,,,,B,DQ,Germany
Richard Brandes,M,,Masters 40-44,Single-ply,101.7,110,,,,,200,-215,-215,200,,,,,200,B,2,Netherlands
Vincenzo Calabrese,M,,Masters 45-49,Single-ply,96.5,100,,,,,90,95,100,100,,,,,100,B,1,Italy
Uwe Fritsche,M,,Masters 45-49,Single-ply,108.3,110,,,,,170,175,180,180,,,,,180,B,1,Germany
Richard West,M,,Masters 45-49,Single-ply,108.8,110,,,,,165,175,,175,,,,,175,B,2,England
Alexej Walter,M,,Open,Single-ply,117.9,125,,,,,-240,250,-260,250,,,,,250,B,2,Germany
Michael Lienshöft,M,,Open,Single-ply,119.3,125,,,,,215,220,-225,220,,,,,220,B,3,Germany
Vico Ruck,M,,Open,Single-ply,114.8,125,,,,,252.5,-257.5,-260,252.5,,,,,252.5,B,1,Germany
Andreas Fritsche,M,,Masters 40-44,Single-ply,113.7,125,,,,,205,210,215,215,,,,,215,B,1,Germany
Jaap Fahner,M,,Masters 40-44,Single-ply,121,125,,,,,210,-227.5,-227.5,210,,,,,210,B,2,Netherlands
Jörg Herzinger,M,,Masters 45-49,Single-ply,114.3,125,,,,,205,-210,210,210,,,,,210,B,1,Germany
Gerd Mäule,M,,Masters 50-54,Single-ply,124.5,125,,,,,210,215,-225,215,,,,,215,B,1,Germany
Salvatore Mazzucco,M,,Masters 60-64,Single-ply,110.8,125,,,,,-125,125,-130,125,,,,,125,B,1,Italy
Alvaro Alvarez Martinez,M,,Open,Single-ply,126.5,140,,,,,215,-225,225,225,,,,,225,B,3,Mexico
Ralf Fickert,M,,Open,Single-ply,134.1,140,,,,,240,250,-280,250,,,,,250,B,1,Germany
Danilo Volkmann,M,,Open,Single-ply,134.5,140,,,,,230,-240,240,240,,,,,240,B,2,Germany
John van Iren,M,,Masters 40-44,Single-ply,125.7,140,,,,,215,220,-227.5,220,,,,,220,B,1,Netherlands
Richard Fricker,M,,Masters 40-44,Single-ply,157.3,140+,,,,,175,187.5,200,200,,,,,200,B,1,England
