
Note: No compatibility mode selected!


Circuit: rc circuit with ac input

Doing analysis at TEMP = 27.000000 and TNOM = 27.000000

Using SPARSE 1.3 as Direct Linear Solver
Note: vac1: has no value, DC 0 assumed

No. of Data Rows : 50
                            rc circuit with ac input
                            AC Analysis  Sat Dec 14 14:01:03  2024
--------------------------------------------------------------------------------
Index   frequency       v(out)
--------------------------------------------------------------------------------
0	1.000000e+02	2.724436e+02,	-1.71181e+02
1	3.020408e+02	8.258064e+01,	-1.56720e+02
2	5.040816e+02	3.444713e+01,	-1.09102e+02
3	7.061224e+02	1.837143e+01,	-8.15085e+01
4	9.081633e+02	1.132292e+01,	-6.46104e+01
5	1.110204e+03	7.652150e+00,	-5.33785e+01
6	1.312245e+03	5.508739e+00,	-4.54200e+01
7	1.514286e+03	4.151806e+00,	-3.95025e+01
8	1.716327e+03	3.239706e+00,	-3.49370e+01
9	1.918367e+03	2.597654e+00,	-3.13107e+01
10	2.120408e+03	2.128850e+00,	-2.83625e+01
11	2.322449e+03	1.776220e+00,	-2.59193e+01
12	2.524490e+03	1.504367e+00,	-2.38620e+01
13	2.726531e+03	1.290404e+00,	-2.21063e+01
14	2.928571e+03	1.119003e+00,	-2.05905e+01
15	3.130612e+03	9.795899e-01,	-1.92687e+01
16	3.332653e+03	8.646778e-01,	-1.81061e+01
17	3.534694e+03	7.688483e-01,	-1.70755e+01
18	3.736735e+03	6.881010e-01,	-1.61556e+01
19	3.938776e+03	6.194309e-01,	-1.53297e+01
20	4.140816e+03	5.605454e-01,	-1.45840e+01
21	4.342857e+03	5.096710e-01,	-1.39074e+01
22	4.544898e+03	4.654182e-01,	-1.32907e+01
23	4.746939e+03	4.266863e-01,	-1.27263e+01
24	4.948980e+03	3.925940e-01,	-1.22078e+01
25	5.151020e+03	3.624290e-01,	-1.17299e+01
26	5.353061e+03	3.356106e-01,	-1.12880e+01
27	5.555102e+03	3.116617e-01,	-1.08782e+01
28	5.757143e+03	2.901871e-01,	-1.04970e+01
29	5.959184e+03	2.708574e-01,	-1.01416e+01
30	6.161224e+03	2.533962e-01,	-9.80950e+00
31	6.363265e+03	2.375703e-01,	-9.49844e+00
32	6.565306e+03	2.231818e-01,	-9.20648e+00
33	6.767347e+03	2.100617e-01,	-8.93193e+00
34	6.969388e+03	1.980652e-01,	-8.67327e+00
35	7.171429e+03	1.870676e-01,	-8.42916e+00
36	7.373469e+03	1.769611e-01,	-8.19841e+00
37	7.575510e+03	1.676519e-01,	-7.97995e+00
38	7.777551e+03	1.590583e-01,	-7.77283e+00
39	7.979592e+03	1.511088e-01,	-7.57618e+00
40	8.181633e+03	1.437406e-01,	-7.38923e+00
41	8.383673e+03	1.368985e-01,	-7.21129e+00
42	8.585714e+03	1.305334e-01,	-7.04171e+00
43	8.787755e+03	1.246022e-01,	-6.87992e+00
44	8.989796e+03	1.190661e-01,	-6.72539e+00
45	9.191837e+03	1.138909e-01,	-6.57766e+00
46	9.393878e+03	1.090459e-01,	-6.43627e+00
47	9.595918e+03	1.045036e-01,	-6.30083e+00
48	9.797959e+03	1.002393e-01,	-6.17097e+00
49	1.000000e+04	9.623075e-02,	-6.04636e+00


Total analysis time (seconds) = 0.000116

Total CPU time (seconds) = 0.084

Total DRAM available = 24576.000 MB.
DRAM currently available = 1009.594 MB.
Maximum ngspice program size =   55.719 MB.
Current ngspice program size =   55.719 MB.

