{
    "header": "Student Information",
    "name": "Name: ",
    "nationality": "Nationality: ",
    "address": "Address: ",
    "field_of_study": "Field of study: ",
    "save": "Save",
    "changeLanguage": "Switch language"
}