<?xml version="1.0"?>
<robot name="gokart" xmlns:xacro="http://ros.org/wiki/xacro">
    <link name = "depth_camera_link">
        <visual>
            <origin xyz="0 0 0" rpy="0 0 0" />
            <geometry>
                <box size="0.03 0.2 0.03" />
            </geometry>
        </visual>
    </link>

    <joint name="depth_camera_joint" type="fixed">
        <parent link="base_link" />
        <child link="depth_camera_link" />
        <origin xyz="0.755 0.0 0.30" rpy="0 0 0" />
        <!-- <origin xyz="0.755 0.0 0.30" rpy="${-pi/2} 0 ${-pi/2}" /> -->
    </joint>

    <gazebo reference="depth_camera_link">
        <sensor name="depth_camera" type="depth">
            <always_on>true</always_on>
            <update_rate>30.0</update_rate>
            <camera>
                <horizontal_fov>1.15192</horizontal_fov>
                <image>
                    <format>B8G8R8</format>
                    <width>1275</width>
                    <height>961</height>
                </image>
                <noise>
                <type>gaussian</type>
                    <mean>0.0</mean>
                    <stddev>0.01</stddev>
                </noise>
            </camera>
            <plugin name="depth_camera_controller" filename="libgazebo_ros_camera.so">
                <alwaysOn>true</alwaysOn>
                <updateRate>0.0</updateRate>
                <cameraName>depth_camera</cameraName>
                <imageTopicName>image_raw</imageTopicName>
                <cameraInfoTopicName>camera_info</cameraInfoTopicName>
                <frame_name>depth_cam_frame_rot</frame_name>
                <hackBaseline>0.0</hackBaseline>
                <distortionK1>0.0</distortionK1>
                <distortionK2>0.0</distortionK2>
                <distortionK3>0.0</distortionK3>
                <distortionT1>0.0</distortionT1>
                <distortionT2>0.0</distortionT2>
            </plugin>
        </sensor>
    </gazebo>
</robot>
