E,N,U
-0.0,0.0,0.0
-39.30912406497772,-0.9619709453313839,-0.001312428027077317
-80.27548187385842,-1.9648718815190547,0.05696777075941384
-82.32410321015396,-2.0024677129496355,0.07219489546000091
-84.41620914114634,-2.0233537697542854,0.06975889921085354
-85.3973937581182,-2.0212541514737654,0.07788127133356681
-87.66988859898173,-2.0161104516672346,0.0770694873746578
-88.2366828256713,-1.9977843610467827,0.07244320869335752
-109.68287199434704,1.0398393893040483,0.8492458601442223
-113.28100578590656,-1.165203806024064,0.2277435333867146
-113.78257006423351,-1.126631163320822,0.23329771602611515
-113.97745632705977,-1.0723328640666865,0.2353551856080145
-113.96859550920475,-1.0121058271843624,0.23589093417621143
-112.52009212572486,2.0738906945473574,1.0842037834815983
-112.44660383689904,2.785798954804338,1.2874623772644043
-110.55806063497496,2.884993310760475,1.335777358435422
-109.97845594878058,2.9346981754230343,1.3550945301466157
-109.30486180811367,2.971714662044393,1.3793296562825645
-107.09105777710954,3.0074621011826057,1.41118440264691
-106.49040319062328,3.018212567748331,1.415521899955408
-103.85907348174811,3.029407943866683,1.4197839137473096
-102.73104975457801,3.029743376996665,1.432160073481512
-100.01304141385111,3.000755356581993,1.4392748346967608
-97.80019613599498,2.951749095946919,1.4029736786584124
-95.88929833089965,2.883525205667152,1.3853341370681989
-95.39249298770761,2.8541934909036524,1.3556214428209046
-95.07306227686325,2.8254903589517157,1.3451599453274525
-93.98718344383035,2.757103262583576,1.321176900340916
-93.96449980858019,2.716680257982925,1.3211783715752716
-95.22906597424645,2.6397100239216607,1.2989260930255568
-95.22779654489037,2.602492331477009,1.2902459901131493
-93.91112505645006,2.486945144466756,1.2568202137505722
-91.86475637532628,2.3537439776998808,1.2073076336849624
-88.5731069051802,1.8593377509178874,1.0119448942793525
-79.0525394509131,1.0646179287489852,0.694074134063456
-76.9920676842888,1.0797626833088771,0.6960335826578614
-76.41190385285344,1.4590176557208325,0.8216798764510145
-75.2528803835965,1.0752048478035814,0.6973434466347612
-75.24967371848253,1.0389677815804053,0.6765925386742566
-76.60452164077009,0.9560341830293572,0.6412060285091599
-82.25155177188756,0.6880994637394093,0.5211564197592082
-84.36814037907715,0.48129103679922147,0.4481003252570588
-87.8188921896703,1.2215987200288658,0.7415038445351598
-88.21227405930057,1.1099164649498916,0.7039083099685541
-84.85659321057125,0.15693319337484896,0.3267981330584604
-81.45882780857703,-0.004247209129539298,0.24835037850560582
-77.25094450311698,-0.11504859928632978,0.16756227844776106
-74.04284824139063,-0.157372210419996,0.13906983232325842
-70.142283034877,-0.16990484008220455,0.15054783744785993
-67.1566902096144,-0.15666746443346385,0.1586673640053533
-63.434636284153996,-0.12094196156216289,0.18153215701855174
-59.560764229160334,-0.06286922815955816,0.22770429174747164
-55.12555009863045,0.03535467291537808,0.2720461331587529
-52.868240175707854,0.10080768307639071,0.3086043782018635
-49.88148180635967,0.22411293992521453,0.3568683768592109
-47.407939881075166,0.38449449770977395,0.4162026577530611
-45.612930640111024,0.5430634587894243,0.5202211836785011
-44.66035371073109,0.6530376362631342,0.561622280877458
-40.10287910758828,-0.3476902811345342,0.26028592477641155
-39.432210301581435,-0.2988713322268577,0.27956708307605993
-38.84395472803317,-0.23859243949140196,0.30285807711481993
-38.41863242030259,-0.1816560436499372,0.33675365750320907
-38.12034364458918,-0.12153512398167482,0.35158728148331875
-38.02761870884308,-0.06786714833803537,0.36952146250531825
-38.119408093745506,0.00136144311214903,0.3680377629966216
-38.3766171057455,2.1932940160078953,1.0256854017589205
-44.00166748880005,2.643018101825078,1.2051894304180166
-44.12878301697517,2.694278727304306,1.224505652900163
-44.095695625262856,2.7472160869988906,1.2374762924528113
-44.08899355505808,2.7795047027424302,1.2518976808163558
-43.87583975281737,2.820536705550812,1.263141705217862
-42.68270852059299,2.870574290743003,1.25731134147901
-42.02720543243903,2.911469572493175,1.2540032286387657
-40.35885829348971,2.9596330228146006,1.2712226090447132
-38.229798767821805,3.0049199766835675,1.2495295919343192
-36.312942644853536,3.035419028094858,1.216267225852107
-34.23173416207077,3.058200285381302,1.207888430316757
-30.264482668524412,3.0828255723179625,1.1454618178541551
-28.922684279753984,3.0902554595809093,1.1390722230910058
-25.383848327929883,3.094055258125609,1.091395144371063
-22.648660617849444,3.0907734828183226,1.0615591352228506
-20.185843893575274,3.0765172174648754,1.0359954469948036
-17.88913704991375,3.054270497537538,1.0206716296615639
-15.722228176599963,3.0238981014408495,0.957187232249467
-12.894912398127001,2.9653669057090726,0.8804851842351695
-11.324745473251568,2.9123591466237517,0.8158191571868656
-10.009066159352038,2.851437443939866,0.7671561201679111
-9.270435100557428,2.226187277282789,0.5373072992541097
-9.040444557794732,2.1826906886309407,0.5314006315026063
-9.010290122578503,2.1353003666759016,0.518204377457451
-9.16735850353141,2.094410744527997,0.4986691475981502
-9.528948225687511,2.0498128161401796,0.4914037093526531
-11.640790640807467,1.8428852140589784,0.40946871917925876
-16.187517383898857,2.3859494024041092,0.6870024418186631
-17.65048778449804,2.3458826884310744,0.7188501722343119
-17.898783670805894,2.285692554116852,0.6995324205172011
-17.87325351164167,2.239414826655668,0.6995319211463027
-17.63689233320426,2.177411098797079,0.6995316134603087
-16.314087676143153,2.1241718892795527,0.6387734005379144
-14.458481747913497,1.1717167916372035,0.22663028926876905
-13.683588276378359,1.1354414498324479,0.19097484878452065
-12.296004188295285,1.0286044879634046,0.15135980389651138
-10.220864752287785,0.9597165511696415,0.09983096083480802
-7.736651609534105,0.9099766277343178,0.06778270188675606
-5.853675884321553,1.4529685472138463,0.30069093833041904
-3.6470956001781425,1.5888940367584576,0.36405946542885204
-0.249713989458029,0.2688790770601911,0.03918233365055812
0.8856703475236456,0.7551696929177953,0.019878235412548406
2.5228598396795503,0.2479559119319315,0.018181308072669822
3.187900148889005,0.6599568377366485,0.011352719618557217
4.067087044909259,0.22122895894773698,0.012283265432458279
4.0244486224407945,0.19428020191959866,0.023435948816199925
2.981100505813811,0.13086632943982077,0.019935114888014027
2.6829960559430486,0.09791805590392383,0.019935955189168908
1.6450216268361797,0.05251517841017983,0.006549276030455076
1.185648122055884,0.030590429050456322,-0.0004199489869449735
-0.0,0.0,0.0
