latitude,longitude,altitude
-86.94444393973747,40.43770230344438,206.7533628020807
-86.9444166906309,40.43768876051782,206.777039704422
-86.94437725184856,40.43767039202783,206.7451365636433
-86.94434422100829,40.43765537570302,206.7425698227599
-86.94430558481365,40.43763780957138,208.3556600100239
-86.94427866346078,40.43762547425793,206.784790796414
-86.94424211631106,40.4376059064608,206.7847959259291
-86.94419981206519,40.43758794999147,206.7848031165869
-86.94416578829771,40.43757179871823,206.784784829427
-86.94413194935647,40.43755729187575,206.7848034645904
-86.94410420852687,40.43754603886454,206.7847669808082
-86.94407467835002,40.43753158568801,206.8582990762034
-86.94404105959046,40.43752640534462,206.8815709958305
-86.94400135141167,40.437525849179,206.8395740077013
-86.94397083337854,40.43754080490394,206.784679801686
-86.94394214658338,40.43755577198863,206.7847955482179
-86.94391292461171,40.43757706195091,206.784839190121
-86.94387942081612,40.43759847031799,206.7848177539539
-86.94384761964135,40.43762150182405,206.8580443715886
-86.94381959276323,40.43764483137443,206.9188788206204
-86.9437894824339,40.4376652140928,206.9393085885407
-86.9437609619807,40.43768893626689,206.9994866293985
-86.9437560254199,40.43772317565907,207.0507386278906
-86.94375309645817,40.43775789873054,207.0993892902727
-86.94375046169455,40.43778960152363,207.1746596193263
-86.94374986838075,40.43782176360951,207.2329914138766
-86.94375141951103,40.4378542471627,207.3171313012147
-86.94375143411587,40.43788012338769,207.3878970559107
-86.94375304859261,40.43791178852743,207.4029591611683
-86.9437560647345,40.43795288472782,207.4029370968972
-86.94375449396644,40.43799818775295,207.4029642623904
-86.94375562310731,40.43803988036328,207.5574942629328
-86.94375645629081,40.43808452871048,207.6100281224368
-86.94375742887917,40.43812805661996,207.6460594675374
-86.94375768966087,40.438181839381,207.709977656271
-86.94375675844647,40.43822426366867,207.8577696228325
-86.94375975015737,40.43827530845157,208.0211268624525
-86.9437678981476,40.43831803638112,208.0210945377366
-86.94379103488421,40.43834856022777,208.1315164406373
-86.94382667356122,40.43836750279026,208.1755951404706
-86.94386537881621,40.43837656926594,208.1557079963098
-86.94390741764464,40.43836864785732,208.2018122816722
-86.94394043801506,40.43835277390979,208.1755938007986
-86.94396225473574,40.43832641374904,208.1738267748013
-86.94397064019248,40.43828853028859,208.068649668106
-86.94396971619366,40.43825492941643,207.9689337125275
-86.94398252049318,40.43821619161788,207.8337047715584
-86.94399915513614,40.43819141950682,207.7443030881851
-86.94402446812622,40.43817057876195,207.7120257050019
-86.9440540491601,40.43814979895167,207.7119708477663
-86.94408997466287,40.43813310453576,207.7120108964625
-86.94411916236004,40.43811124966633,207.5997810219813
-86.94413495361452,40.43808726522643,207.5279244800033
-86.94413967945316,40.438061320452,207.480537899332
-86.94412690120824,40.43803725026733,207.4166484902054
-86.9441054397095,40.43801851652622,207.3611673394963
-86.94408782447907,40.43800222297188,207.3286373397193
-86.94407035186047,40.43798717213486,207.2754120227126
-86.94405325659461,40.43796624619244,207.2513601791305
-86.94403769065516,40.43794264265944,207.2476362388814
-86.94403291337335,40.4379170059117,207.1631710503148
-86.94404079958083,40.43789401258712,207.030203290419
-86.94406112631619,40.43787392747983,207.0195727509298
-86.94408905421257,40.4378581057685,206.9369098131056
-86.94411321205328,40.43784672304474,206.9195902699344
-86.9441382811472,40.43784093079969,206.8736072128665
-86.94416890038863,40.43783872222625,206.8732859674349
-86.94419836858246,40.43784180903731,206.9064121651209
-86.94422676845227,40.43784580319844,206.9334932759535
-86.94424959796072,40.43785067400842,206.9423047247257
-86.94427715937668,40.43785836591296,206.9512742194316
-86.94430262849106,40.43786952503997,207.0266173477065
-86.94433072611716,40.43788274532041,207.0704109888144
-86.94435087202361,40.43789408672311,207.1111589527503
-86.94437151155829,40.43791108662985,207.1733759815161
-86.94439050733882,40.43793399625542,207.2275565936105
-86.94440671429767,40.43796299904473,207.2911928910164
-86.94441961824889,40.43799155454744,207.3404750835658
-86.944425563568,40.43802315525821,207.4831745662857
-86.94442194486403,40.43805164551377,207.5039452856897
-86.94441708875394,40.43808465013305,207.5604565777039
-86.94440850893537,40.43812067308503,207.6031258237278
-86.94439472063226,40.43815518038215,207.6706654784098
-86.94438537840975,40.43818732297261,207.7245783739534
-86.94437453516373,40.43821890187956,207.7922359395795
-86.94436860289788,40.43825460242457,207.864084130888
-86.94437251145911,40.43829183745834,208.021097139275
-86.94438839412123,40.43832749921081,208.0467267642649
-86.94441724530948,40.43835214392251,208.0698068349348
-86.9444575798353,40.43836984004617,208.0337274681797
-86.94449215591536,40.43837930804033,207.950374262572
-86.94452368924367,40.43838508514393,207.9248320487066
-86.94455622001796,40.43838758834055,207.8695135217335
-86.94458853106785,40.4383873387942,207.8500005025614
-86.9446206925177,40.4383839084199,207.7733912130426
-86.94464638423793,40.4383776722939,207.7279263968543
-86.94467571933828,40.43836754427167,207.6216625275517
-86.94470027643418,40.4383538549027,207.5604383089345
-86.94471674860173,40.4383408711591,207.5534214279492
-86.94473161622552,40.43831971274763,207.4913783641556
-86.94473837115682,40.4382978673064,207.4641689461279
-86.94474053224388,40.43827789484249,207.4281125532628
-86.94473996106822,40.43825760788913,207.3384781163739
-86.94473442677351,40.43823731757864,207.3290997741343
-86.94472079952793,40.43821731682536,207.2889919343547
-86.94470754588383,40.438193998206,207.2409714370042
-86.94469551323395,40.43817237641218,207.1650329567802
-86.94468452163741,40.43815030749972,207.0968299494151
-86.94467573188385,40.43813163044514,207.0554055472984
-86.944665833314,40.43811001904496,207.0515600873372
-86.94466679416415,40.43808609846688,207.0195564909611
-86.94467230051218,40.43806350999578,206.9729681949664
-86.94468684726365,40.43804440687271,206.9128459506707
-86.94470251741308,40.43802994410215,206.8300687587686
-86.94472394930922,40.43802335166805,206.7877565742444
-86.94474679230061,40.43801599538142,206.7877483339174
-86.94477035041399,40.43800870386023,206.7877691504686
-86.94479721180656,40.43800088379503,206.7676771298535
-86.94481844988395,40.43798553590853,206.7421624818269
-86.9448357763338,40.43797438774278,206.7104893642924
-86.9448460669101,40.43795974359654,206.7513222580596
-86.94485389900892,40.43793955987264,206.7104927594485
-86.94484762539584,40.43791181764486,206.7252632066458
-86.94483210409493,40.43788729193095,206.7667810618503
-86.94480589241662,40.43786818133905,206.7578579534654
-86.94477968760577,40.4378543119502,206.7564821739463
-86.94474158596789,40.43783660365711,206.7447369792274
-86.94471236180652,40.43782306919746,206.746499723084
-86.94468289069425,40.4378111399602,206.7408405749481
-86.94465532606678,40.43779926946386,206.7589893878398
-86.9446278917618,40.43778676421069,206.7940040958689
-86.94460297582394,40.43777551289961,206.7198422669098
-86.94457430366386,40.43776250163819,206.7722472377982
-86.94454691395846,40.43774914914266,206.7761418327422
-86.94452241568524,40.43773667458743,206.7772996305041
-86.94449580145185,40.43772499829908,206.7663004704232
-86.94447195576035,40.43771351528162,206.7440685493713
-86.94444393973747,40.43770230344438,206.7533628020807