[
	{
		"namespace" : "experiments.config",
		"description" : "Parses about:config API into WebExtensions",
		"permissions" : ["experiments.config"],
		"functions" : [
			{
				"name" : "prefGet",
				"type" : "function",
				"description" : "Returns about:config pref value. The name is strange because when using `get` it silently just doesn't work",
				"parameters" : [
					{
						"type": "string",
						"name": "name",
						"description": "Name of param to get",
						"optional": false
					}
				],
				"async": true
			},
			{
				"name" : "prefSet",
				"type" : "function",
				"description" : "Sets about:config pref value. The name is strange because when using `get` it silently just doesn't work",
				"parameters" : [
					{
						"type": "string",
						"name": "name",
						"description": "Name of param to st",
						"optional": false
					},
					{
						"type": "any",
						"name": "value",
						"description": "Value to set",
						"optional": false
					}
				],
				"async": true
			}
		]
	}
]