{
    "options": {
        "fill_vertical": true,
        "fill_horizontal": true,
        "max_data_points_in_view": 1400
    },
    "default_zoom": {
        "tmin": "-PT72H",
        "tmax": "PT12H"
    },
    "global_margins": {
        "top": 20,
        "bottom": 0,
        "left": 65,
        "right": 50
    },
    "subplots": [
        {
            "subplot_id": "ipir_swarmc_ne",
            "title": "WAM-IPE Ne sampled along the Swarm C track",
            "visible": true,
            "ydomain": {
                "default": [-90, 90],
                "min_range": [-90, 90],
                "max_range": [-90, 90],
                "step": 0.5
            },
            "annot_options": {
                "annot_horizontal_grid_lines": [
                    {"y": -60},
                    {"y": -30},
                    {"y": 0},
                    {"y": 30},
                    {"y": 60}
                ]
            },
            "y_label": "Geographic latitude (deg)",
            "scale": "linear",
            "tick_format": "g",
            "xaxis_annotation": "visible",
            "yaxis_annotation": "visible",
            "height": 150,
            "margins": {
                "top": 20,
                "bottom": 30
            },
            "plot_elements": [
                {
                    "server": "http://localhost:9000/hapi",
                    "dataset": "wam_ipe_ne_swarmc",
                    "cadence_suffix_from_catalog": true,
                    "time_parameter": "time",
                    "parameter": "latitude",
                    "color_scale_parameter": "Ne",
                    "plot_options": {
                        "plot_type": "colormappedsymbols",
                        "color_scale_parameter": "electron_density",
                        "color_scale_parameter_multiplier": 1e-6,
                        "color_scale_label": "Electron density (10⁶/cm³)",
                        "color_scale_domain": {
                            "default": [0, 1.5],
                            "range_extent": [0, 5],
                            "step": 1
                        },
                        "stroke": "#000000",
                        "stroke-width": "1",
                        "stroke-opacity": "1",
                        "fill": "#67D1F4",
                        "fill-opacity": "0.6",
                        "mirror_zero_x": false
                    }
                }
            ]
        },
        {
            "subplot_id": "ipir_swarmc_ne",
            "title": "Swarm C measured Ne from the IPIR product",
            "visible": true,
            "ydomain": {
                "default": [-90, 90],
                "min_range": [-90, 90],
                "max_range": [-90, 90],
                "step": 0.5
            },
            "annot_options": {
                "annot_horizontal_grid_lines": [
                    {"y": -60},
                    {"y": -30},
                    {"y": 0},
                    {"y": 30},
                    {"y": 60}
                ]
            },
            "y_label": "Geographic latitude (deg)",
            "scale": "linear",
            "tick_format": "g",
            "xaxis_annotation": "visible",
            "yaxis_annotation": "visible",
            "height": 150,
            "margins": {
                "top": 10,
                "bottom": 30
            },
            "plot_elements": [
                {
                    "server": "http://localhost:9000/hapi",
                    "dataset": "sunspots_silso",
                    "cadence_suffix_from_catalog": true,
                    "time_parameter": "time",
                    "parameter": "sunspot_number",
                    "plot_options": {
                        "plot_type": "image_interval",
                        "stroke": "#000000",
                        "stroke-width": "1",
                        "stroke-opacity": "1"
                    }
                },
                {
                    "server": "http://localhost:9000/hapi",
                    "dataset": "ipir_swarmc",
                    "cadence_suffix_from_catalog": true,
                    "time_parameter": "time",
                    "parameter": "Latitude",
                    "color_scale_parameter": "Ne",
                    "plot_options": {
                        "plot_type": "colormappedsymbols",
                        "color_scale_parameter": "Ne",
                        "color_scale_parameter_multiplier": 1e-6,
                        "color_scale_label": "Electron density (10⁶/cm³)",
                        "color_scale_domain": {
                            "default": [0, 1.5],
                            "range_extent": [0, 5],
                            "step": 1
                        },
                        "stroke": "#000000",
                        "stroke-width": "1",
                        "stroke-opacity": "1",
                        "fill": "#67D1F4",
                        "fill-opacity": "0.6",
                        "mirror_zero_x": false
                    }
                }
            ]
        },
        {
            "subplot_id": "ipir_swarmc_ne",
            "title": "Swarm C measured (orange) and WAM-IPE modelled (light blue) Ne",
            "visible": true,
            "ydomain": {
                "default": [0, 2.5],
                "min_range": [0, 5],
                "max_range": [0, 5],
                "step": 0.1
            },
            "y_label": "Electron density (10⁶/cm³)",
            "scale": "linear",
            "tick_format": "g",
            "xaxis_annotation": "visible",
            "yaxis_annotation": "visible",
            "height": 150,
            "margins": {
                "top": 10,
                "bottom": 40
            },
            "plot_elements": [
                {
                    "server": "http://localhost:9000/hapi",
                    "dataset": "wam_ipe_ne_swarmc",
                    "cadence_suffix_from_catalog": true,
                    "time_parameter": "time",
                    "parameter": "electron_density",
                    "parameter_multiplier": 1e-6,
                    "plot_options": {
                        "plot_type": "area",
                        "stroke": "#000000",
                        "stroke-width": "1",
                        "stroke-opacity": "1",
                        "fill": "#67D1F4",
                        "fill-opacity": "0.6",
                        "mirror_zero_x": false
                    }
                },
                {
                    "server": "http://localhost:9000/hapi",
                    "dataset": "ipir_swarmc",
                    "cadence_suffix_from_catalog": true,
                    "time_parameter": "time",
                    "parameter": "Ne",
                    "parameter_multiplier": 1e-6,
                    "plot_options": {
                        "plot_type": "area",
                        "stroke": "#000000",
                        "stroke-width": "1",
                        "stroke-opacity": "1",
                        "fill": "#FFB52E",
                        "fill-opacity": "0.6",
                        "mirror_zero_x": false
                    }
                }
            ]
        }
    ]
}
