{
  "options": {
    "fill_vertical": true,
    "fill_horizontal": true,
    "max_data_points_in_view": 1400
  },
  "default_zoom": {
    "tmin": "-PT12H",
    "tmax": "PT3H"
  },
  "global_margins": {
    "top": 0,
    "bottom": 0,
    "left": 65,
    "right": 30
  },
  "subplots": [
    {
      "title": "Swarm A and C electron density",
      "visible": true,
      "minimized": true,
      "legend_visible": true,
      "ydomain": {
        "default": [
          0,
          1.5
        ],
        "bounds": [
          "0",
          "6"
        ]
      },
      "y_label": "Ne (10⁶/cm³)",
      "scale": "linear",
      "ytick_format": ".1f",
      "xaxis_annotation": "hidden",
      "yaxis_annotation": "visible",
      "height": 207,
      "annot_options": {
        "annot_horizontal_grid_lines": [],
        "annot_text_items": []
      },
      "margins": {
        "top": 20,
        "bottom": 10
      },
      "plot_elements": [
        {
          "title": "Swarm C max Ne",
          "visible": true,
          "minimized": true,
          "server": "http://82.168.152.210/hapi",
          "cadence_alternative_datasets_mode": "knmi",
          "max_points": 1000,
          "plot_options": {
            "plot_type": "area",
            "baseline_mode": "constant",
            "baseline": 0,
            "stroke": "#008cb4",
            "stroke-width": "1",
            "stroke-opacity": "1",
            "fill": "#caf0fe",
            "fill-opacity": 0.13,
            "curve_type": "natural",
            "parameter_offset": 0,
            "parameter_offset_remove_mean": false,
            "parameter_multiplier": 0.000001
          },
          "dataset": "ipir_ne_swarmc_minmaxmean_PT1H40M",
          "parameter": "Ne_max",
          "time_parameter": "time"
        },
        {
          "title": "Swarm A Ne",
          "visible": true,
          "minimized": true,
          "server": "http://82.168.152.210/hapi",
          "cadence_alternative_datasets_mode": "knmi",
          "max_points": 1000,
          "plot_options": {
            "plot_type": "line",
            "stroke": "#b51a00",
            "stroke-width": 2,
            "stroke-opacity": "1",
            "fill": "#AAAAAA",
            "fill-opacity": "1",
            "curve_type": "linear",
            "baseline_mode": "constant",
            "parameter_offset": 0,
            "parameter_offset_remove_mean": false,
            "parameter_multiplier": 0.000001
          },
          "dataset": "ipir_swarma_PT1S",
          "parameter": "Ne",
          "time_parameter": "time"
        },
        {
          "title": "Swarm A Ne 2Hz fast data",
          "visible": true,
          "minimized": true,
          "server": "http://82.168.152.210/hapi",
          "cadence_alternative_datasets_mode": "knmi",
          "parameter_multiplier": 1,
          "parameter_offset": 0,
          "parameter_offset_remove_mean": false,
          "max_points": 4000,
          "plot_options": {
            "plot_type": "line",
            "stroke": "#dd4236",
            "stroke-width": 1.5,
            "stroke-opacity": 0.8,
            "fill": "#f22602",
            "fill-opacity": 0.16,
            "mirror_zero_x": false,
            "curve_type": "linear",
            "parameter_offset_remove_mean": false,
            "parameter_offset": 0,
            "parameter_multiplier": 0.000001,
            "baseline_mode": ""
          },
          "dataset": "swarma_efi_lp_fast_2Hz",
          "parameter": "Ne",
          "time_parameter": "time"
        },
        {
          "title": "Swarm C Ne",
          "visible": true,
          "minimized": true,
          "server": "http://82.168.152.210/hapi",
          "cadence_alternative_datasets_mode": "knmi",
          "max_points": 1000,
          "plot_options": {
            "plot_type": "line",
            "baseline_mode": "constant",
            "baseline": 0,
            "stroke": "#008cb4",
            "stroke-width": 2,
            "stroke-opacity": "1",
            "fill": "#AAAAAA",
            "fill-opacity": "1",
            "curve_type": "linear",
            "parameter_offset": 0,
            "parameter_offset_remove_mean": false,
            "parameter_multiplier": 0.000001
          },
          "dataset": "ipir_swarmc_PT1S",
          "parameter": "Ne",
          "time_parameter": "time"
        },
        {
          "title": "WAM-IPE Ne for Swarm C",
          "visible": true,
          "minimized": true,
          "server": "http://82.168.152.210/hapi",
          "max_points": 1000,
          "plot_options": {
            "plot_type": "line",
            "stroke": "#74a7fe",
            "stroke-width": 3,
            "stroke-opacity": 0.41,
            "fill": "#AAAAAA",
            "fill-opacity": "1",
            "curve_type": "linear",
            "parameter_offset": 0,
            "parameter_offset_remove_mean": false,
            "parameter_multiplier": 0.000001
          },
          "dataset": "wam_ipe_ne_swarmc_PT10S",
          "parameter": "electron_density",
          "time_parameter": "time",
          "cadence_alternative_datasets_mode": "knmi"
        }
      ]
    },
    {
      "title": "Swarm A FAST electron density",
      "visible": true,
      "minimized": true,
      "ydomain": {
        "default": [
          -90,
          90
        ],
        "bounds": [
          -90,
          90
        ],
        "mirror": false
      },
      "y_label": "Quasi-dipole latitude",
      "scale": "linear",
      "ytick_format": "d",
      "xaxis_annotation": "visible",
      "yaxis_annotation": "visible",
      "height": 150,
      "annot_options": {
        "annot_horizontal_grid_lines": [],
        "annot_text_items": []
      },
      "margins": {
        "top": 30,
        "bottom": 40
      },
      "plot_elements": [
        {
          "title": "Swarm A FAST electron density",
          "visible": true,
          "minimized": true,
          "server": "http://82.168.152.210/hapi",
          "cadence_alternative_datasets_mode": "knmi",
          "parameter_multiplier": 1,
          "parameter_offset": 0,
          "parameter_offset_remove_mean": false,
          "max_points": 4000,
          "plot_options": {
            "color_map": "Turbo",
            "color_map_domain": {
              "bounds": [
                "0",
                "5"
              ],
              "trim": [
                0,
                1
              ]
            },
            "parameter_multiplier": 1,
            "parameter_offset_remove_mean": false,
            "parameter_offset": 0,
            "color_parameter_multiplier": 0.000001,
            "color_parameter_offset_remove_mean": false,
            "color_parameter_offset": 0,
            "reverse_color_map": false,
            "symbol_type": "rectangle",
            "symbol_height": 11,
            "symbol_width": 2.5,
            "plot_type": "color_mapped_symbols",
            "stroke": "#000000",
            "stroke-width": 0,
            "stroke-opacity": 0,
            "fill": "#888888",
            "fill-opacity": "1",
            "mirror_zero_x": false,
            "curve_type": "linear",
            "baseline_mode": ""
          },
          "dataset": "swarma_efi_lp_fast_2Hz",
          "parameter": "lat_qd",
          "time_parameter": "time",
          "color_map_parameter": "Ne"
        }
      ],
      "legend_visible": true
    }
  ]
}