{
    "id": "kp_index_forecast_noaa_new",
    "description": "Geomagnetic Kp index forecast from NOAA",
    "timeStampLocation": "begin",
    "resourceURL": "https://services.swpc.noaa.gov/products/",
    "resourceID": "NOAA Space Weather Prediction Center",
    "contact": "",
    "contactID": "",
    "resampleMethod": "maximum",
    "subsets": [
        {
            "cadence": "PT3H",
            "additionalDescription": ""
        },
        {
            "cadence": "P1DT",
            "additionalDescription": "downsampled to 1 day"
        }
    ],
    "parameters": [
        {
            "name": "time",
            "type": "isotime",
            "units": "UTC",
            "fill": "",
            "description": "Time of forecasted epoch",
            "label": "",
            "key": true
        },
        {
            "name": "timetag_issue",
            "type": "isotime",
            "units": "UTC",
            "fill": "",
            "description": "Time of forecast issue",
            "label": "",
            "key": true
        },
        {
            "name": "kp_index",
            "type": "double",
            "units": "",
            "fill": null,
            "description": "Geomagnetic Kp index",
            "label": "",
            "key": false
        }
    ]
}
