    {
    "options": {
        "fill_vertical": true,
        "fill_horizontal": true
    },
    "default_zoom": {
        "tmin": "-PT72H",
        "tmax": "PT12H"
    },
    "global_margins": {
        "top": 20,
        "bottom": 0,
        "left": 50,
        "right": 50
    },
    "subplots": [
        {
            "subplot_id": "kp_index",
            "title": "Kp index",
            "visible": true,
            "ydomain": {
                "default": [0, 9],
                "min_range": [0, 9],
                "max_range": [1, 15],
                "step": 0.3333,
                "mirror": false
            },
            "scale": "linear",
            "tickformat": "1d",
            "xaxis_annotation": "hidden",
            "yaxis_annotation": "visible",
            "height": 150,
            "margins": {
                "top": 10,
                "bottom": 10
            },
            "plot_elements": [
                {
                    "server": "http://localhost:9000/hapi",
                    "dataset": "kp_index",
                    "cadence_suffix_from_catalog": true,
                    "time_parameter": "time",
                    "parameter": "kp_index",
                    "plot_options": {
                        "plot_type": "bars",
                        "bar_offset_seconds": 1800,
                        "bar_padding": 0.2,
                        "bar_text": true,
                        "stroke-width": "0",
                        "fill_colors": [
                            {"threshold": 4.6, "color": "#88CC66"},
                            {"threshold": 5.6, "color": "#FFF033"},
                            {"threshold": 6.6, "color": "#FFBB44"},
                            {"threshold": 7.6, "color": "#DD9922"},
                            {"threshold": 8.6, "color": "#FF2020"},
                            {"threshold": 9.6, "color": "#A02020"},
                            {"threshold":1000, "color": "#300000"}
                        ]
                    }
                }
            ]
        },
        {
            "subplot_id": "imf",
            "title": "Interplanetary Magnetic Field near L1 (nT)",
            "visible": true,
            "ydomain": {
                "default": [-40, 40],
                "min_range": [-150, 0],
                "max_range": [0, 150],
                "step": 1,
                "mirror": true
            },
            "scale": "linear",
            "tick_format": "1d",
            "xaxis_annotation": "hidden",
            "yaxis_annotation": "visible",
            "height": 280,
            "margins": {
                "top": 10,
                "bottom": 10
            },
            "plot_elements": [
                {
                    "server": "http://localhost:9000/hapi",
                    "dataset": "solar_wind_mag_dscovr",
                    "cadence_suffix_from_catalog": true,
                    "time_parameter": "time",
                    "parameter": "bt",
                    "plot_options": {
                        "plot_type": "area",
                        "stroke": "#000000",
                        "stroke-width": "0",
                        "stroke-opacity": "1",
                        "fill": "#C5D0D9",
                        "fill-opacity": "1",
                        "mirror_zero_x": true
                    }
                },
                {
                    "server": "http://localhost:9000/hapi",
                    "dataset": "solar_wind_mag_dscovr",
                    "cadence_suffix_from_catalog": true,
                    "time_parameter": "time",
                    "parameter": "bz_gsm",
                    "plot_options": {
                        "plot_type": "area",
                        "stroke": "#000000",
                        "stroke-width": "0",
                        "stroke-opacity": "1",
                        "fill": "#C4472E",
                        "fill-opacity": "1",
                        "mirror_zero_x": false
                    }
                },
                {
                    "server": "http://localhost:9000/hapi",
                    "dataset": "solar_wind_mag_dscovr",
                    "cadence_suffix_from_catalog": true,
                    "time_parameter": "time",
                    "parameter": "by_gsm",
                    "plot_options": {
                        "plot_type": "line",
                        "stroke": "#1E90FF",
                        "stroke-width": "1",
                        "stroke-opacity": "1",
                        "fill": "#000000",
                        "fill-opacity": "0",
                        "mirror_zero_x": false
                    }
                }
            ]
        },
        {
            "subplot_id": "solarwindspeed",
            "title": "Solar wind speed near L1 (km/s)",
            "visible": true,
            "ydomain": {
                "default": [200, 800],
                "min_range": [0, 500],
                "max_range": [400, 3000],
                "step": 1,
                "mirror": false
            },
            "scale": "linear",
            "tick_format": "1d",
            "xaxis_annotation": "hidden",
            "yaxis_annotation": "visible",
            "height": 200,
            "margins": {
                "top": 10,
                "bottom": 10
            },
            "plot_elements": [
                {
                    "server": "http://localhost:9000/hapi",
                    "dataset": "solar_wind_plasma_dscovr",
                    "cadence_suffix_from_catalog": true,
                    "time_parameter": "time",
                    "parameter": "speed",
                    "plot_options": {
                        "plot_type": "area",
                        "stroke": "#C8911E",
                        "stroke-width": "1",
                        "stroke-opacity": "1",
                        "fill": "#C8911E",
                        "fill-opacity": "0.5",
                        "mirror_zero_x": false
                    }
                }
            ]
        },
        {
            "subplot_id": "solarwinddensity",
            "title": "Solar wind density near L1 (1/cm3)",
            "visible": true,
            "ydomain": {
                "default": [-1, 2],
                "min_range": [-2, 1],
                "max_range": [1, 3],
                "step": 0.1,
                "mirror": false
            },
            "scale": "log10",
            "tick_format": "1d",
            "xaxis_annotation": "visible",
            "yaxis_annotation": "visible",
            "height": 200,
            "margins": {
                "top": 10,
                "bottom": 40
            },
            "plot_elements": [
                {
                    "server": "http://localhost:9000/hapi",
                    "dataset": "solar_wind_plasma_dscovr",
                    "cadence_suffix_from_catalog": true,
                    "time_parameter": "time",
                    "parameter": "density",
                    "plot_options": {
                        "plot_type": "area",
                        "stroke": "#5E91C8",
                        "stroke-width": "1",
                        "stroke-opacity": "1",
                        "fill": "#5E91C8",
                        "fill-opacity": "0.5",
                        "mirror_zero_x": false
                    }
                }
            ]
        }
    ]
}
