{
    "id": "xray_flux_goes_primary",
    "description": "X-ray flux from primary GOES satellites",
    "timeStampLocation": "begin",
    "resourceURL": "https://data.ngdc.noaa.gov/platforms/solar-space-observing-satellites/goes/goes17/l2/data/xrsf-l2-avg1m_science/",
    "resourceID": "NOAA NGDC",
    "contact": "",
    "contactID": "",
    "resampleMethod": "max",
    "subsets": [
        {
            "cadence": "PT1M",
            "additionalDescription": ""
        },
        {
            "cadence": "PT5M",
            "additionalDescription": "downsampled to 5 minutes"
        },
        {
            "cadence": "PT30M",
            "additionalDescription": "downsampled to 30 minutes"
        },
        {
            "cadence": "PT3H",
            "additionalDescription": "downsampled to 3 hours"
        },
        {
            "cadence": "PT12H",
            "additionalDescription": "downsampled to 12 hours"
        },
        {
            "cadence": "P3D",
            "additionalDescription": "downsampled to 3 days"
        },
        {
            "cadence": "P10D",
            "additionalDescription": "downsampled to 10 days"
        }
    ],
    "parameters": [
        {
            "name": "time",
            "type": "isotime",
            "units": "UTC",
            "fill": "",
            "description": "Time",
            "label": "",
            "key": true
        },
        {
            "name": "xray_flux_short",
            "type": "double",
            "units": "",
            "fill": null,
            "description": "Solar X-ray flux in the 0.05-0.4 nm passband",
            "label": "",
            "key": false
        },
        {
            "name": "xray_flux_long",
            "type": "double",
            "units": "",
            "fill": null,
            "description": "Solar X-ray flux in the 0.1-0.8 nm passband",
            "label": "",
            "key": false
        }
    ]
}
