{
    "id": "sunspots_silso",
    "description": "SILSO total and daily estimated sunspot number",
    "timeStampLocation": "begin",
    "resourceURL": "https://wwwbis.sidc.be/silso/datafiles",
    "resourceID": "SILSO/SIDC",
    "contact": "silso.info@oma.be",
    "contactID": "",
    "resampleMethod": "max",
    "subsets": [
        {
            "cadence": "P1D",
            "additionalDescription": "downsampled to 1 day"
        },
        {
            "cadence": "P7D",
            "additionalDescription": "downsampled to 7 days"
        },
        {
            "cadence": "P27D",
            "additionalDescription": "downsampled to 27 days"
        },
        {
            "cadence": "P81D",
            "additionalDescription": "downsampled to 81 days"
        },
        {
            "cadence": "P365D",
            "additionalDescription": "downsampled to 365 days"
        }
    ],
    "parameters": [
        {
            "name": "time",
            "type": "isotime",
            "units": "UTC",
            "fill": "",
            "description": "Time",
            "label": "",
            "key": true
        },
        {
            "name": "sunspot_number",
            "type": "double",
            "units": "",
            "fill": null,
            "description": "Sunspot number",
            "label": "",
            "key": false
        }
    ]
}
