{
    "id": "gnss_scint_san0p",
    "description": "GNSS scintillation for the san0p station",
    "timeStampLocation": "begin",
    "resourceURL": "http://eswua.ingv.it/",
    "resourceID": "INGV ESWUA",
    "contact": "",
    "contactID": "",
    "resampleMethod": "max",
    "subsets": [
        {
            "cadence": "PT1M",
            "additionalDescription": ""
        },
        {
            "cadence": "PT5M",
            "additionalDescription": "downsampled to 5 minutes"
        },
        {
            "cadence": "PT30M",
            "additionalDescription": "downsampled to 30 minutes"
        },
        {
            "cadence": "PT3H",
            "additionalDescription": "downsampled to 3 hours"
        },
        {
            "cadence": "PT12H",
            "additionalDescription": "downsampled to 12 hours"
        },
        {
            "cadence": "P3D",
            "additionalDescription": "downsampled to 3 days"
        },
        {
            "cadence": "P10D",
            "additionalDescription": "downsampled to 10 days"
        }
    ],
    "parameters": [
        {
            "name": "time",
            "type": "isotime",
            "units": "UTC",
            "fill": "",
            "description": "Time",
            "label": "",
            "key": true
        },
        {
            "name": "phi60l1slant_max",
            "type": "double",
            "units": "",
            "fill": null,
            "description": "Maximum phi60l1slant",
            "label": "",
            "key": false
        },
        {
            "name": "totals4l1_max",
            "type": "double",
            "units": "",
            "fill": null,
            "description": "Maximum totals4l1",
            "label": "",
            "key": false
        },
        {
            "name": "phi60l1slant_sats_mod",
            "type": "double",
            "units": "",
            "fill": null,
            "description": "Number of satellites measuring phi60l1slant over the mod threshold",
            "label": "",
            "key": false
        },
        {
            "name": "phi60l1slant_sats_sev",
            "type": "double",
            "units": "",
            "fill": null,
            "description": "Number of satellites measuring phi60l1slant over the sev threshold",
            "label": "",
            "key": false
        },
        {
            "name": "totals4l1_sats_mod",
            "type": "double",
            "units": "",
            "fill": null,
            "description": "Number of satellites measuring totals4l1 over the mod threshold",
            "label": "",
            "key": false
        },
        {
            "name": "totals4l1_sats_sev",
            "type": "double",
            "units": "",
            "fill": null,
            "description": "Number of satellites measuring totals4l1 over the sev threshold",
            "label": "",
            "key": false
        }
    ]
}
