{
    "id": "aa_h_index",
    "description": "Harmonized aa index",
    "timeStampLocation": "begin",
    "resourceURL": "https://www.swsc-journal.org/articles/swsc/olm/2018/01/swsc180022/swsc180022-2-olm.txt",
    "resourceID": "Lockwood et al., 2018",
    "contact": "",
    "contactID": "",
    "resampleMethod": "max",
    "subsets": [
        {
            "cadence": "P1D",
            "additionalDescription": "downsampled to 1 day"
        },
        {
            "cadence": "P7D",
            "additionalDescription": "downsampled to 7 days"
        },
        {
            "cadence": "P27D",
            "additionalDescription": "downsampled to 27 days"
        },
        {
            "cadence": "P81D",
            "additionalDescription": "downsampled to 81 days"
        },
        {
            "cadence": "P365D",
            "additionalDescription": "downsampled to 365 days"
        }
    ],
    "parameters": [
        {
            "name": "time",
            "type": "isotime",
            "units": "UTC",
            "fill": "",
            "description": "Time",
            "label": "",
            "key": true
        },
        {
            "name": "aa_h_index",
            "type": "double",
            "units": "",
            "fill": null,
            "description": "aa_H index",
            "label": "",
            "key": false
        }
    ]
}
