{
    "id": "f10_7",
    "description": "Penticton F10.7",
    "timeStampLocation": "begin",
    "resourceURL": "ftp://ftp.seismo.nrcan.gc.ca/spaceweather/solar_flux/daily_flux_values",
    "resourceID": "NRCAN",
    "contact": "",
    "contactID": "",
    "resampleMethod": "max",
    "subsets": [
        {
            "cadence": "P1D",
            "additionalDescription": ""
        },
        {
            "cadence": "P7D",
            "additionalDescription": "downsampled to 7 days"
        },
        {
            "cadence": "P27D",
            "additionalDescription": "downsampled to 27 days"
        },
        {
            "cadence": "P81D",
            "additionalDescription": "downsampled to 81 days"
        },
        {
            "cadence": "P365D",
            "additionalDescription": "downsampled to 365 days"
        }
    ],
    "parameters": [
        {
            "name": "time",
            "type": "isotime",
            "units": "UTC",
            "fill": "",
            "description": "Time",
            "label": "",
            "key": true
        },
        {
            "name": "f10_7",
            "type": "double",
            "units": "",
            "fill": null,
            "description": "Penticton noontime 10.7 cm solar radio flux",
            "label": "",
            "key": false
        }
    ]
}
