    {
    "options": {
        "fill_vertical": true,
        "fill_horizontal": true
    },
    "default_zoom": {
        "tmin": "-PT72H",
        "tmax": "PT12H"
    },
    "global_margins": {
        "top": 20,
        "bottom": 0,
        "left": 50,
        "right": 50
    },
    "subplots": [
        {
            "subplot_id": "kp_index",
            "title": "Kp index",
            "visible": true,
            "ydomain": {
                "default": [0, 9],
                "min_range": [0, 9],
                "max_range": [0, 9],
                "step": 0.3333,
                "mirror": false
            },
            "scale": "linear",
            "tickformat": "1d",
            "xaxis_annotation": "hidden",
            "yaxis_annotation": "visible",
            "height": 150,
            "margins": {
                "top": 10,
                "bottom": 10
            },
            "plot_elements": [
                {
                    "server": "http://localhost:9000/hapi",
                    "dataset": "kp_index",
                    "cadence_suffix_from_catalog": true,
                    "time_parameter": "time",
                    "parameter": "kp_index",
                    "plot_options": {
                        "plot_type": "bars",
                        "bar_offset_seconds": 1800,
                        "bar_padding": 0.2,
                        "bar_text": true,
                        "stroke-width": "0px",
                        "fill_colors": [
                            {"threshold": 4.6, "color": "#88CC66"},
                            {"threshold": 5.6, "color": "#FFF033"},
                            {"threshold": 6.6, "color": "#FFBB44"},
                            {"threshold": 7.6, "color": "#DD9922"},
                            {"threshold": 8.6, "color": "#FF2020"},
                            {"threshold": 9.6, "color": "#A02020"},
                            {"threshold":1000, "color": "#300000"}
                        ]
                    }
                }
            ]
        },
        {
            "subplot_id": "aa_h_index",
            "title": "aa_h geomagnetic activity index",
            "visible": true,
            "ydomain": {
                "default": [0, 500],
                "min_range": [0, 80],
                "max_range": [80, 1000],
                "step": 1
            },
            "scale": "linear",
            "tick_format": "1d",
            "xaxis_annotation": "hidden",
            "yaxis_annotation": "visible",
            "height": 150,
            "margins": {
                "top": 5,
                "bottom": 10
            },
            "plot_elements": [
                {
                    "server": "http://localhost:9000/hapi",
                    "dataset": "aa_h_index",
                    "cadence_suffix_from_catalog": true,
                    "time_parameter": "time",
                    "parameter": "aa_h_index",
                    "plot_options": {
                        "plot_type": "area",
                        "stroke": "#a93333",
                        "stroke-width": "1.5px",
                        "stroke-opacity": "100%",
                        "fill": "#a93333",
                        "fill-opacity": "50%",
                        "mirror_zero_x": false
                    }
                }
            ]
        },
        {
            "subplot_id": "solar_flux",
            "title": "Sunspot number and 10.7 cm radio flux",
            "visible": true,
            "ydomain": {
                "default": [0, 350],
                "min_range": [0, 80],
                "max_range": [80, 500],
                "step": 1
            },
            "scale": "linear",
            "tick_format": "1d",
            "xaxis_annotation": "hidden",
            "yaxis_annotation": "visible",
            "height": 150,
            "margins": {
                "top": 5,
                "bottom": 10
            },
            "plot_elements": [
                {
                    "server": "http://localhost:9000/hapi",
                    "dataset": "f10_7",
                    "cadence_suffix_from_catalog": true,
                    "time_parameter": "time",
                    "parameter": "f10_7",
                    "plot_options": {
                        "plot_type": "area",
                        "stroke": "none",
                        "stroke-width": "0px",
                        "stroke-opacity": "100%",
                        "fill": "#C5D0D9",
                        "fill-opacity": "100%",
                        "mirror_zero_x": false
                    }
                },
                {
                    "server": "http://localhost:9000/hapi",
                    "dataset": "sunspots_silso",
                    "cadence_suffix_from_catalog": true,
                    "time_parameter": "time",
                    "parameter": "sunspot_number",
                    "plot_options": {
                        "plot_type": "line",
                        "stroke": "#000",
                        "stroke-width": "1px",
                        "stroke-opacity": "100%"                    }
                }
            ]
        },
        {
            "subplot_id": "xrayflux",
            "title": "GOES 0.1-0.8 nm X-ray flux",
            "visible": true,
            "ydomain": {
                "default": [-9, -2],
                "min_range": [-11, -1],
                "max_range": [-11, -1],
                "step": 0.1,
                "mirror": false
            },
            "scale": "log10",
            "tick_format": "1d",
            "annot_options": {
                "annot_horizontal_grid_lines": [
                    {"y": 1e-6},
                    {"y": 1e-5},
                    {"y": 1e-4},
                    {"y": 1e-3}
                ],
                "annot_text_items": [
                    {"y": 3.163e-6, "text": "C"},
                    {"y": 3.163e-5, "text": "M"},
                    {"y": 3.163e-4, "text": "X"}
                ]
            },
            "xaxis_annotation": "hidden",
            "yaxis_annotation": "visible",
            "height": 200,
            "margins": {
                "top": 10,
                "bottom": 10
            },
            "plot_elements": [
                {
                    "server": "http://localhost:9000/hapi",
                    "dataset": "xray_flux_combined",
                    "cadence_suffix_from_catalog": true,
                    "time_parameter": "time",
                    "parameter": "xray_flux_long",
                    "plot_options": {
                        "plot_type": "area",
                        "stroke": "#70A1BA",
                        "stroke-width": "1px",
                        "stroke-opacity": "100%",
                        "fill": "#9ADEFF",
                        "fill-opacity": "50%",
                        "mirror_zero_x": false
                    }
                }
            ]
        },
        {
            "subplot_id": "protonflux",
            "title": "GOES >10, >50 and >100 MeV proton flux",
            "visible": true,
            "ydomain": {
                "default": [-1, 3],
                "min_range": [-3, 6],
                "max_range": [-3, 6],
                "step": 0.1,
                "mirror": false
            },
            "scale": "log10",
            "tick_format": "1d",
            "xaxis_annotation": "visible",
            "yaxis_annotation": "visible",
            "height": 200,
            "margins": {
                "top": 10,
                "bottom": 60
            },
            "plot_elements": [
                {
                    "server": "http://localhost:9000/hapi",
                    "dataset": "proton_flux",
                    "cadence_suffix_from_catalog": true,
                    "time_parameter": "time",
                    "parameter": "proton_flux_10MeV",
                    "plot_options": {
                        "plot_type": "area",
                        "stroke": "#3781C4",
                        "stroke-width": "1px",
                        "stroke-opacity": "100%",
                        "fill": "#3781C4",
                        "fill-opacity": "20%",
                        "mirror_zero_x": false
                    }
                },
                {
                    "server": "http://localhost:9000/hapi",
                    "dataset": "proton_flux",
                    "cadence_suffix_from_catalog": true,
                    "time_parameter": "time",
                    "parameter": "proton_flux_50MeV",
                    "plot_options": {
                        "plot_type": "area",
                        "stroke": "#3781C4",
                        "stroke-width": "1px",
                        "stroke-opacity": "100%",
                        "fill": "#3781C4",
                        "fill-opacity": "20%",
                        "mirror_zero_x": false
                    }
                },
                {
                    "server": "http://localhost:9000/hapi",
                    "dataset": "proton_flux",
                    "cadence_suffix_from_catalog": true,
                    "time_parameter": "time",
                    "parameter": "proton_flux_100MeV",
                    "plot_options": {
                        "plot_type": "area",
                        "stroke": "#3781C4",
                        "stroke-width": "1px",
                        "stroke-opacity": "100%",
                        "fill": "#3781C4",
                        "fill-opacity": "20%",
                        "mirror_zero_x": false
                    }
                }
            ]
        }
    ]
}
