{
    "options": {
        "fill_vertical": true,
        "fill_horizontal": true,
        "zoom_detail_factor": 1
    },
    "default_zoom": {
        "tmin": "-P3D",
        "tmax": "P3D"
    },
    "global_margins": {
        "top": 0,
        "bottom": 0,
        "left": 65,
        "right": 30
    },
  "subplots": [
    {
      "title": "X-Ray alerts",
      "visible": true,
      "legend_visible": false,
      "ydomain": {
        "default": [ 0, "5" ],
        "bounds": [ "0", "5" ]
      },
      "y_label": "",
      "scale": "linear",
      "ytick_format": "d",
      "xaxis_annotation": "hidden",
      "yaxis_annotation": "hidden",
      "height": 80,
      "annot_options": {
        "annot_horizontal_grid_lines": [
          { "y": 1 },
          { "y": 2 },
          { "y": 3 },
          { "y": 4 }
        ],
        "annot_text_items": [
          {
            "y": 4.5,
            "align": "right",
            "text": "Alert: Flux > M5"
          },
          {
            "y": 3.5,
            "align": "right",
            "text": "Summary: Event > M5"
          },
          {
            "y": 2.5,
            "align": "right",
            "text": "Summary: Event > X1"
          },
          {
            "y": 1.5,
            "align": "right",
            "text": "Summary: Event > X10"
          },
          {
            "y": 0.5,
            "align": "right",
            "text": "Summary: Event > X20"
          }
        ]
      },
      "margins": {
        "top": 10,
        "bottom": 0
      },
      "plot_elements": [
        {
          "title": "X-Ray alerts",
          "visible": true,
          "plot_options": {
            "plot_type": "notification",
            "stroke_width": "5",
            "type": "xray"
          },
          "data": {
            "server": "https://hapi.acc.spaceweather.knmi.nl/hapi",
            "dataset": "xray_alerts_noaa",
            "parameter": "original_message",
            "text_parameter": "product_id",
            "time_parameter": "time",
            "start_time_parameter": "begin_time",
            "stop_time_parameter": "end_time",
            "cadence_alternative_datasets_mode": "x_relations",
            "refetch_interval_seconds": 600,
            "zoom_detail_factor": 1.0
          },
          "data_transforms": {}
        }
      ]
    },
    {
      "title": "Proton events",
      "visible": true,
      "legend_visible": false,
      "ydomain": {
        "default": [ 0, "6" ],
        "bounds": [ "0", "6" ]
      },
      "y_label": "",
      "scale": "linear",
      "ytick_format": "d",
      "xaxis_annotation": "hidden",
      "yaxis_annotation": "hidden",
      "height": 80,
      "annot_options": {
        "annot_horizontal_grid_lines": [
          { "y": 1 },
          { "y": 2 },
          { "y": 3 },
          { "y": 4 },
          { "y": 5 }
        ],
        "annot_text_items": [
          {
            "y": 5.5,
            "align": "right",
            "position": "outside",
            "text": ">10 MeV >10 pfu (S1)"
          },
          {
            "y": 4.5,
            "align": "right",
            "position": "outside",
            "text": ">10 MeV >100 pfu (S2)"
          },
          {
            "y": 3.5,
            "align": "right",
            "position": "outside",
            "text": ">10 MeV >10³ pfu (S3)"
          },
          {
            "y": 2.5,
            "align": "right",
            "position": "outside",
            "text": ">10 MeV >10³ pfu (S4)"
          },
          {
            "y": 1.5,
            "align": "right",
            "position": "outside",
            "text": ">10 MeV >100,000 pfu (S5)"
          },
          {
            "y": 0.5,
            "align": "right",
            "position": "outside",
            "text": ">100 MeV >1 pfu"
          }
        ]
      },
      "margins": {
        "top": 0,
        "bottom": 0
      },
      "plot_elements": [
        {
          "title": "Proton events",
          "visible": true,
          "plot_options": {
            "plot_type": "notification",
            "stroke_width": "5",
            "type": "xray"
          },
          "data": {
            "server": "https://hapi.acc.spaceweather.knmi.nl/hapi",
            "dataset": "proton_alerts_noaa",
            "parameter": "original_message",
            "text_parameter": "product_id",
            "time_parameter": "time",
            "start_time_parameter": "begin_time",
            "stop_time_parameter": "end_time",
            "cadence_alternative_datasets_mode": "x_relations",
            "refetch_interval_seconds": 600,
            "zoom_detail_factor": 1.0
          },
          "data_transforms": {}
        }
      ]
    },
    {
      "title": "Radio events",
      "visible": true,
      "legend_visible": false,
      "ydomain": {
        "default": [ 0, 3 ],
        "bounds": [ 0, 3 ]
      },
      "y_label": "",
      "scale": "linear",
      "ytick_format": "d",
      "xaxis_annotation": "hidden",
      "yaxis_annotation": "hidden",
      "height": 48,
      "annot_options": {
        "annot_horizontal_grid_lines": [
          { "y": 1 },
          { "y": 2 }
        ],
        "annot_text_items": [
          {
            "y": 2.5,
            "align": "right",
            "text": "Type II"
          },
          {
            "y": 1.5,
            "align": "right",
            "text": "Type IV"
          },
          {
            "y": 0.5,
            "align": "right",
            "text": "10 cm"
          }
        ]
      },
      "margins": {
        "top": 0,
        "bottom": 0
      },
      "plot_elements": [
        {
          "title": "Radio events",
          "visible": true,
          "plot_options": {
            "plot_type": "notification",
            "stroke_width": "5",
            "type": "xray"
          },
          "data": {
            "server": "https://hapi.acc.spaceweather.knmi.nl/hapi",
            "dataset": "radio_alerts_noaa",
            "parameter": "original_message",
            "text_parameter": "product_id",
            "time_parameter": "time",
            "start_time_parameter": "begin_time",
            "stop_time_parameter": "end_time",
            "cadence_alternative_datasets_mode": "x_relations",
            "refetch_interval_seconds": 600,
            "zoom_detail_factor": 1.0
          },
          "data_transforms": {}
        }
      ]
    },
    {
      "title": "Electron flux events",
      "visible": true,
      "legend_visible": false,
      "ydomain": {
        "default": [ 0, 1 ],
        "bounds": [ 0, 1 ]
      },
      "y_label": "",
      "scale": "linear",
      "ytick_format": "d",
      "xaxis_annotation": "hidden",
      "yaxis_annotation": "hidden",
      "height": 32,
      "annot_options": {
        "annot_horizontal_grid_lines": [],
        "annot_text_items": [
          {
            "y": 0.5,
            "align": "right",
            "text": ">2 Mev >1 Kpfu"
          }
        ]
      },
      "margins": {
        "top": 0,
        "bottom": 20
      },
      "plot_elements": [
        {
          "title": "Electron flux events",
          "visible": true,
          "plot_options": {
            "plot_type": "notification",
            "stroke_width": "5",
            "type": "electronflux"
          },
          "data": {
            "server": "https://hapi.acc.spaceweather.knmi.nl/hapi",
            "dataset": "electronflux_alerts_noaa",
            "parameter": "original_message",
            "text_parameter": "product_id",
            "time_parameter": "time",
            "start_time_parameter": "begin_time",
            "stop_time_parameter": "end_time",
            "cadence_alternative_datasets_mode": "x_relations",
            "refetch_interval_seconds": 600,
            "zoom_detail_factor": 1.0
          },
          "data_transforms": {}
        }
      ]
    },
    {
      "title": "Geomagnetic events",
      "visible": true,
      "legend_visible": false,
      "ydomain": {
        "default": [ 0, "11" ],
        "bounds": [ "0", "11" ]
      },
      "y_label": "",
      "scale": "linear",
      "ytick_format": "d",
      "xaxis_annotation": "visible",
      "yaxis_annotation": "hidden",
      "height": 176,
      "annot_options": {
        "annot_horizontal_grid_lines": [
          { "y": 1 },
          { "y": 2 },
          { "y": 3 },
          { "y": 4 },
          { "y": 5 },
          { "y": 6 },
          { "y": 7 },
          { "y": 8 },
          { "y": 9 },
          { "y": 10 }
        ],
        "annot_text_items": [
          {
            "y": 10.5,
            "align": "right",
            "text": "Sudden Impulse"
          },
          {
            "y": 9.5,
            "align": "right",
            "text": "K=4"
          },
          {
            "y": 8.5,
            "align": "right",
            "text": "K=5 (G1)"
          },
          {
            "y": 7.5,
            "align": "right",
            "text": "K=6 (G2)"
          },
          {
            "y": 6.5,
            "align": "right",
            "text": "K=7 (G3)"
          },
          {
            "y": 5.5,
            "align": "right",
            "text": "K=8 (G4)"
          },
          {
            "y": 4.5,
            "align": "right",
            "text": "K=9 (G5)"
          },
          {
            "y": 3.5,
            "align": "right",
            "text": "G1 Watch"
          },
          {
            "y": 2.5,
            "align": "right",
            "text": "G2 Watch"
          },
          {
            "y": 1.5,
            "align": "right",
            "text": "G3 Watch"
          },
          {
            "y": 0.5,
            "align": "right",
            "text": "G4 or greater Watch"
          }
        ]
      },
      "margins": {
        "top": 0,
        "bottom": 30
      },
      "plot_elements": [
        {
          "title": "Geomagnetic events",
          "visible": true,
          "plot_options": {
            "plot_type": "notification",
            "stroke_width": "5",
            "type": "xray"
          },
          "data": {
            "server": "https://hapi.acc.spaceweather.knmi.nl/hapi",
            "dataset": "geomagnetic_alerts_noaa",
            "parameter": "original_message",
            "text_parameter": "product_id",
            "time_parameter": "time",
            "start_time_parameter": "begin_time",
            "stop_time_parameter": "end_time",
            "cadence_alternative_datasets_mode": "x_relations",
            "refetch_interval_seconds": 600,
            "zoom_detail_factor": 1.0
          },
          "data_transforms": {}
        }
      ]
    },
    {

      "title": "GNSS events",
      "visible": true,
      "legend_visible": false,
      "ydomain": {
        "default": [ 0, "2" ],
        "bounds": [ "0", "2" ]
      },
      "y_label": "",
      "scale": "linear",
      "ytick_format": "d",
      "xaxis_annotation": "hidden",
      "yaxis_annotation": "visible",
      "height": 40,
      "annot_options": {
        "annot_horizontal_grid_lines": [
          { "y": 1 },
          { "y": 2 }
        ],
        "annot_text_items": [
          {
            "y": 1.5,
            "align": "right",
            "text": "Severe"
          },
          {
            "y": 0.5,
            "align": "right",
            "text": "Moderate"
          }
        ]
      },
      "margins": {
        "top": 10,
        "bottom": 0
      },
      "plot_elements": [
        {
          "title": "GNSS events",
          "visible": true,
          "plot_options": {
            "plot_type": "icao_pecasus",
            "stroke_width": "5",
            "type": "gnss"
          },
          "data": {
            "server": "https://hapi.acc.spaceweather.knmi.nl/hapi",
            "dataset": "gnss_alerts_icao_pecasus",
            "parameter": "message",
            "text_parameter": "message_code",
            "time_parameter": "time",
            "start_time_parameter": "begin_time",
            "stop_time_parameter": "end_time",
            "cadence_alternative_datasets_mode": "x_relations",
            "refetch_interval_seconds": 600,
            "zoom_detail_factor": 1.0
          },
          "data_transforms": {}
        }
      ]
    },
    {
      "title": "HF events",
      "visible": true,
      "legend_visible": false,
      "ydomain": {
        "default": [ 0, "2" ],
        "bounds": [ "0", "2" ]
      },
      "y_label": "",
      "scale": "linear",
      "ytick_format": "d",
      "xaxis_annotation": "hidden",
      "yaxis_annotation": "visible",
      "height": 40,
      "annot_options": {
        "annot_horizontal_grid_lines": [
          { "y": 1 },
          { "y": 2 }
        ],
        "annot_text_items": [
          {
            "y": 1.5,
            "align": "right",
            "position": "outside",
            "text": "Severe"
          },
          {
            "y": 0.5,
            "align": "right",
            "position": "outside",
            "text": "Moderate"
          }
        ]
      },
      "margins": {
        "top": 0,
        "bottom": 0
      },
      "plot_elements": [
        {
          "title": "HF events",
          "visible": true,
          "plot_options": {
            "plot_type": "icao_pecasus",
            "stroke_width": "5",
            "type": "hf"
          },
          "data": {
            "server": "https://hapi.acc.spaceweather.knmi.nl/hapi",
            "dataset": "hf_alerts_icao_pecasus",
            "parameter": "message",
            "text_parameter": "message_code",
            "time_parameter": "time",
            "start_time_parameter": "begin_time",
            "stop_time_parameter": "end_time",
            "cadence_alternative_datasets_mode": "x_relations",
            "refetch_interval_seconds": 600,
            "zoom_detail_factor": 1.0
          },
          "data_transforms": {}
        }
      ]
    },
    {
      "title": "Radiation events",
      "visible": true,
      "legend_visible": false,
      "ydomain": {
        "default": [ 0, 2 ],
        "bounds": [ 0, 2 ]
      },
      "y_label": "",
      "scale": "linear",
      "ytick_format": "d",
      "xaxis_annotation": "visible",
      "yaxis_annotation": "visible",
      "height": 40,
      "annot_options": {
        "annot_horizontal_grid_lines": [
          { "y": 1 },
          { "y": 2 }
        ],
        "annot_text_items": [
          {
            "y": 1.5,
            "align": "right",
            "position": "outside",
            "text": "Severe"
          },
          {
            "y": 0.5,
            "align": "right",
            "position": "outside",
            "text": "Moderate"
          }
        ]
      },
      "margins": {
        "top": 0,
        "bottom": 40
      },
      "plot_elements": [
        {
          "title": "Radiation events",
          "visible": true,
          "plot_options": {
            "plot_type": "icao_pecasus",
            "stroke_width": "5",
            "type": "rad"
          },
          "data": {
            "server": "https://hapi.acc.spaceweather.knmi.nl/hapi",
            "dataset": "rad_alerts_icao_pecasus",
            "parameter": "message",
            "text_parameter": "message_code",
            "time_parameter": "time",
            "start_time_parameter": "begin_time",
            "stop_time_parameter": "end_time",
            "cadence_alternative_datasets_mode": "x_relations",
            "refetch_interval_seconds": 600,
            "zoom_detail_factor": 1.0
          },
          "data_transforms": {}
        }
      ]
    },
    {

      "title": "Electron events MetOffice",
      "visible": true,
      "legend_visible": false,
      "ydomain": {
        "default": [ 0, "4" ],
        "bounds": [ "0", "4" ]
      },
      "y_label": "",
      "scale": "linear",
      "ytick_format": "d",
      "xaxis_annotation": "hidden",
      "yaxis_annotation": "visible",
      "height": 80,
      "annot_options": {
        "annot_horizontal_grid_lines": [
          { "y": 1 },
          { "y": 2 },
          { "y": 3 },
          { "y": 4 }
        ],
        "annot_text_items": [
          {
            "y": 3.5,
            "align": "right",
            "text": "2 MeV alert"
          },
          {
            "y": 2.5,
            "align": "right",
            "text": "2 MeV summary"
          },
          {
            "y": 1.5,
            "align": "right",
            "text": "Fluence warning"
          },
          {
            "y": 0.5,
            "align": "right",
            "text": "Fluence warning extension"
          }
        ]
      },
      "margins": {
        "top": 10,
        "bottom": 0
      },
      "plot_elements": [
        {
          "title": "Electron events",
          "visible": true,
          "plot_options": {
            "plot_type": "metoffice",
            "stroke_width": "5",
            "type": "electron"
          },
          "data": {
            "server": "https://hapi.acc.spaceweather.knmi.nl/hapi",
            "dataset": "electron_alerts_metoffice",
            "parameter": "message",
            "text_parameter": "product_id",
            "time_parameter": "time",
            "start_time_parameter": "begin_time",
            "stop_time_parameter": "end_time",
            "cadence_alternative_datasets_mode": "x_relations",
            "refetch_interval_seconds": 600,
            "zoom_detail_factor": 1.0
          },
          "data_transforms": {}
        }
      ]
    },
    {
      "title": "Geomagnetic events MetOffice",
      "visible": true,
      "legend_visible": false,
      "ydomain": {
        "default": [ 0, "4" ],
        "bounds": [ "0", "4" ]
      },
      "y_label": "",
      "scale": "linear",
      "ytick_format": "d",
      "xaxis_annotation": "hidden",
      "yaxis_annotation": "visible",
      "height": 80,
      "annot_options": {
        "annot_horizontal_grid_lines": [
          { "y": 1 },
          { "y": 2 },
          { "y": 3 },
          { "y": 4 }
        ],
        "annot_text_items": [
          {
            "y": 3.5,
            "align": "right",
            "position": "outside",
            "text": "Kp-index warning"
          },
          {
            "y": 2.5,
            "align": "right",
            "position": "outside",
            "text": "Kp-index alert"
          },
          {
            "y": 1.5,
            "align": "right",
            "position": "outside",
            "text": "Sudden impulse warning"
          },
          {
            "y": 0.5,
            "align": "right",
            "position": "outside",
            "text": "Sudden impulse alert"
          }
        ]
      },
      "margins": {
        "top": 0,
        "bottom": 0
      },
      "plot_elements": [
        {
          "title": "Geomagnetic events",
          "visible": true,
          "plot_options": {
            "plot_type": "metoffice",
            "stroke_width": "5",
            "type": "geomagnetic"
          },
          "data": {
            "server": "https://hapi.acc.spaceweather.knmi.nl/hapi",
            "dataset": "geomagnetic_alerts_metoffice",
            "parameter": "message",
            "text_parameter": "product_id",
            "time_parameter": "time",
            "start_time_parameter": "begin_time",
            "stop_time_parameter": "end_time",
            "cadence_alternative_datasets_mode": "x_relations",
            "refetch_interval_seconds": 600,
            "zoom_detail_factor": 1.0
          },
          "data_transforms": {}
        }
      ]
    },
    {
      "title": "Proton events MetOffice",
      "visible": true,
      "legend_visible": false,
      "ydomain": {
        "default": [ 0, "6" ],
        "bounds": [ "0", "6" ]
      },
      "y_label": "",
      "scale": "linear",
      "ytick_format": "d",
      "xaxis_annotation": "hidden",
      "yaxis_annotation": "visible",
      "height": 120,
      "annot_options": {
        "annot_horizontal_grid_lines": [
          { "y": 1 },
          { "y": 2 },
          { "y": 3 },
          { "y": 4 },
          { "y": 5 },
          { "y": 6 }
        ],
        "annot_text_items": [
          {
            "y": 5.5,
            "align": "right",
            "position": "outside",
            "text": "10 MeV warning"
          },
          {
            "y": 4.5,
            "align": "right",
            "position": "outside",
            "text": "10 MeV alert"
          },
          {
            "y": 3.5,
            "align": "right",
            "position": "outside",
            "text": "10 MeV summary"
          },
          {
            "y": 2.5,
            "align": "right",
            "position": "outside",
            "text": "100 MeV warning"
          },
          {
            "y": 1.5,
            "align": "right",
            "position": "outside",
            "text": "100 MeV alert"
          },
          {
            "y": 0.5,
            "align": "right",
            "position": "outside",
            "text": "100 MeV summary"
          }
        ]
      },
      "margins": {
        "top": 0,
        "bottom": 0
      },
      "plot_elements": [
        {
          "title": "Proton events",
          "visible": true,
          "plot_options": {
            "plot_type": "metoffice",
            "stroke_width": "5",
            "type": "proton"
          },
          "data": {
            "server": "https://hapi.acc.spaceweather.knmi.nl/hapi",
            "dataset": "proton_alerts_metoffice",
            "parameter": "message",
            "text_parameter": "product_id",
            "time_parameter": "time",
            "start_time_parameter": "begin_time",
            "stop_time_parameter": "end_time",
            "cadence_alternative_datasets_mode": "x_relations",
            "refetch_interval_seconds": 600,
            "zoom_detail_factor": 1.0
          },
          "data_transforms": {}
        }
      ]
    },
    {
      "title": "X-ray events MetOffice",
      "visible": true,
      "legend_visible": false,
      "ydomain": {
        "default": [ 0, 3 ],
        "bounds": [ 0, 3 ]
      },
      "y_label": "",
      "scale": "linear",
      "ytick_format": "d",
      "xaxis_annotation": "visible",
      "yaxis_annotation": "visible",
      "height": 60,
      "annot_options": {
        "annot_horizontal_grid_lines": [
          { "y": 1 },
          { "y": 2 },
          { "y": 3 }
        ],
        "annot_text_items": [
          {
            "y": 2.5,
            "align": "right",
            "position": "outside",
            "text": "Flare event"
          },
          {
            "y": 1.5,
            "align": "right",
            "position": "outside",
            "text": "Radio blackout alert"
          },
          {
            "y": 0.5,
            "align": "right",
            "position": "outside",
            "text": "Radio blackout summary"
          }
        ]
      },
      "margins": {
        "top": 0,
        "bottom": 40
      },
      "plot_elements": [
        {
          "title": "X-ray events",
          "visible": true,
          "plot_options": {
            "plot_type": "metoffice",
            "stroke_width": "5",
            "type": "xray"
          },
          "data": {
            "server": "https://hapi.acc.spaceweather.knmi.nl/hapi",
            "dataset": "xray_alerts_metoffice",
            "parameter": "message",
            "text_parameter": "product_id",
            "time_parameter": "time",
            "start_time_parameter": "begin_time",
            "stop_time_parameter": "end_time",
            "cadence_alternative_datasets_mode": "x_relations",
            "refetch_interval_seconds": 600,
            "zoom_detail_factor": 1.0
          },
          "data_transforms": {}
        }
      ]
    }
  ]
}
