{
    "options": {
        "fill_vertical": true,
        "fill_horizontal": true,
        "zoom_detail_factor": 1
    },
    "default_zoom": {
        "tmin": "-PT18H",
        "tmax": "PT3H"
    },
    "global_margins": {
        "top": 0,
        "bottom": 0,
        "left": 65,
        "right": 30
    },
    "title": "Swarm-SWITCH",
    "subtitle": "Timeline Viewer",
    "subplots": [
        {
            "title": "Swarm orbits and orbit altitude",
            "visible": true,
            "legend_visible": false,
            "globe_visible": true,
            "ydomain": {
                "default": [400, 550],
                "bounds": [200, 600]
            },
            "y_label": "Altitude (km)",
            "scale": "linear",
            "ytick_format": "d",
            "xaxis_annotation": "visible",
            "yaxis_annotation": "visible",
            "height": 130,
            "annot_options": {
                "annot_horizontal_grid_lines": [],
                "annot_text_items": []
            },
            "margins": {
                "top": 20,
                "bottom": 10
            },
            "options_3d": {
                "camera_attached_to": "Sun",
                "x_position": 0.5,
                "render_earth": true
            },
            "plot_elements": [
                {
                    "title": "Eclipse path",
                    "visible": true,
                    "plot_options": {
                        "plot_type": "orbit_on_globe",
                        "frame": "EarthFixed",
                        "stroke": "#000000",
                        "stroke-width": 2.5,
                        "stroke-opacity": 1,
                        "fill": "#000000",
                        "fill-opacity": 0.16,
                        "label": "Totality",
                        "label_position_x": 0.75,
                        "label_position_y": 0.5,
                        "mirror_zero_x": false,
                        "curve_type": "linear",
                        "baseline_mode": ""
                    },
                    "data": {
                        "server": "https://hapi.spaceweather.knmi.nl/hapi",
                        "dataset": "eclipse_path",
                        "parameter": "x_itrf",
                        "time_parameter": "time",
                        "x_coordinate_parameter": "x_itrf",
                        "y_coordinate_parameter": "y_itrf",
                        "z_coordinate_parameter": "z_itrf",
                        "cadence_alternative_datasets_mode": "off",
                        "zoom_detail_factor": 4.0
                    },
                    "data_transforms": {
                        "parameter_multiplier": 1,
                        "parameter_offset": 0,
                        "parameter_offset_remove_mean": false,
                        "coordinate_parameter_multiplier": 0.0001569612306
                    }
                },
                {
                    "title": "Swarm A orbit",
                    "visible": true,
                    "plot_options": {
                        "plot_type": "orbit_on_globe",
                        "stroke": "#006CD9",
                        "stroke-width": 2.5,
                        "stroke-opacity": 1,
                        "fill": "#006CD9",
                        "fill-opacity": 0.16,
                        "label": "A",
                        "label_position_x": 0.75,
                        "label_position_y": 0.5,
                        "mirror_zero_x": false,
                        "curve_type": "linear",
                        "baseline_mode": ""
                    },
                    "data": {
                        "server": "https://hapi.spaceweather.knmi.nl/hapi",
                        "dataset": "sw_fast_moda_sc_PT30S",
                        "parameter": "x_gcrs",
                        "time_parameter": "time",
                        "x_coordinate_parameter": "x_gcrs",
                        "y_coordinate_parameter": "y_gcrs",
                        "z_coordinate_parameter": "z_gcrs",
                        "cadence_alternative_datasets_mode": "off",
                        "zoom_detail_factor": 1.0
                    },
                    "data_transforms": {
                        "parameter_multiplier": 1,
                        "parameter_offset": 0,
                        "parameter_offset_remove_mean": false,
                        "coordinate_parameter_multiplier": 0.0001569612306
                    }
                },
                {
                    "title": "Swarm B orbit",
                    "visible": true,
                    "plot_options": {
                        "plot_type": "orbit_on_globe",
                        "stroke": "#A070DC",
                        "stroke-width": 2.5,
                        "stroke-opacity": 1,
                        "fill": "#A070DC",
                        "fill-opacity": 0.16,
                        "label": "B",
                        "label_position_x": 0.75,
                        "label_position_y": 0.5,
                        "mirror_zero_x": false,
                        "curve_type": "linear",
                        "baseline_mode": ""
                    },
                    "data": {
                        "server": "https://hapi.spaceweather.knmi.nl/hapi",
                        "dataset": "sw_fast_modb_sc_PT30S",
                        "parameter": "x_gcrs",
                        "time_parameter": "time",
                        "x_coordinate_parameter": "x_gcrs",
                        "y_coordinate_parameter": "y_gcrs",
                        "z_coordinate_parameter": "z_gcrs",
                        "cadence_alternative_datasets_mode": "off",
                        "zoom_detail_factor": 1.0
                    },
                    "data_transforms": {
                        "parameter_multiplier": 1,
                        "parameter_offset": 0,
                        "parameter_offset_remove_mean": false,
                        "coordinate_parameter_multiplier": 0.0001569612306
                    }
                },
                {
                    "title": "Swarm C orbit",
                    "visible": true,
                    "plot_options": {
                        "plot_type": "orbit_on_globe",
                        "stroke": "#74a7fe",
                        "stroke-width": 2.5,
                        "stroke-opacity": 1,
                        "fill": "#74a7fe",
                        "fill-opacity": 0.16,
                        "label": "C",
                        "label_position_x": 0.25,
                        "label_position_y": 0.5,
                        "mirror_zero_x": false,
                        "curve_type": "linear",
                        "baseline_mode": ""
                    },
                    "data": {
                        "server": "https://hapi.spaceweather.knmi.nl/hapi",
                        "dataset": "sw_fast_modc_sc_PT30S",
                        "parameter": "x_gcrs",
                        "time_parameter": "time",
                        "x_coordinate_parameter": "x_gcrs",
                        "y_coordinate_parameter": "y_gcrs",
                        "z_coordinate_parameter": "z_gcrs",
                        "cadence_alternative_datasets_mode": "off",
                        "zoom_detail_factor": 1.0
                    },
                    "data_transforms": {
                        "parameter_multiplier": 1,
                        "parameter_offset": 0,
                        "parameter_offset_remove_mean": false,
                        "coordinate_parameter_multiplier": 0.0001569612306
                    }
                },
                {
                    "title": "Swarm A altitude long-term min/max",
                    "visible": true,
                    "plot_options": {
                        "plot_type": "area",
                        "stroke": "#006CD9",
                        "stroke-width": 0,
                        "stroke-opacity": "1",
                        "fill": "#006CD9",
                        "fill-opacity": 0.1,
                        "mirror_zero_x": false,
                        "curve_type": "step",
                        "baseline_mode": "parameter"
                    },
                    "data": {
                        "server": "https://hapi.spaceweather.knmi.nl/hapi",
                        "dataset": "sw_fast_moda_sc_aggregate",
                        "parameter": "height_max",
                        "time_parameter": "time",
                        "baseline_parameter": "height_min",
                        "cadence_alternative_datasets_mode": "x_relations",
                        "parameter_multiplier": 1,
                        "zoom_detail_factor": 1.0
                    },
                    "data_transforms": {
                        "parameter_multiplier": 0.001,
                        "parameter_offset": 0,
                        "parameter_offset_remove_mean": false
                    }
                },
                {
                    "title": "Swarm B altitude long-term min/max",
                    "visible": true,
                    "plot_options": {
                        "plot_type": "area",
                        "stroke": "#A070DC",
                        "stroke-width": 0,
                        "stroke-opacity": "1",
                        "fill": "#A070DC",
                        "fill-opacity": 0.1,
                        "mirror_zero_x": false,
                        "curve_type": "step",
                        "baseline_mode": "parameter"
                    },
                    "data": {
                        "server": "https://hapi.spaceweather.knmi.nl/hapi",
                        "dataset": "sw_fast_modb_sc_aggregate",
                        "parameter": "height_max",
                        "time_parameter": "time",
                        "baseline_parameter": "height_min",
                        "cadence_alternative_datasets_mode": "x_relations",
                        "parameter_multiplier": 1,
                        "zoom_detail_factor": 1.0
                    },
                    "data_transforms": {
                        "parameter_multiplier": 0.001,
                        "parameter_offset": 0,
                        "parameter_offset_remove_mean": false
                    }
                },
                {
                    "title": "Swarm C altitude long-term min/max",
                    "visible": true,
                    "plot_options": {
                        "plot_type": "area",
                        "stroke": "#74a7fe",
                        "stroke-width": 0,
                        "stroke-opacity": "1",
                        "fill": "#74a7fe",
                        "fill-opacity": 0.1,
                        "mirror_zero_x": false,
                        "curve_type": "step",
                        "baseline_mode": "parameter"
                    },
                    "data": {
                        "server": "https://hapi.spaceweather.knmi.nl/hapi",
                        "dataset": "sw_fast_modc_sc_aggregate",
                        "parameter": "height_max",
                        "time_parameter": "time",
                        "baseline_parameter": "height_min",
                        "cadence_alternative_datasets_mode": "x_relations",
                        "parameter_multiplier": 1,
                        "zoom_detail_factor": 1.0
                    },
                    "data_transforms": {
                        "parameter_multiplier": 0.001,
                        "parameter_offset": 0,
                        "parameter_offset_remove_mean": false
                    }
                },
                {
                    "title": "Swarm A altitude long-term mean",
                    "visible": true,
                    "plot_options": {
                        "plot_type": "line",
                        "stroke": "#006CD9",
                        "stroke-width": 1,
                        "stroke-opacity": "1",
                        "fill": "#006CD9",
                        "fill-opacity": 0.1,
                        "mirror_zero_x": false,
                        "curve_type": "step",
                        "baseline_mode": "constant"
                    },
                    "data": {
                        "server": "https://hapi.spaceweather.knmi.nl/hapi",
                        "dataset": "sw_fast_moda_sc_aggregate",
                        "parameter": "height_mean",
                        "time_parameter": "time",
                        "cadence_alternative_datasets_mode": "x_relations",
                        "parameter_multiplier": 1,
                        "zoom_detail_factor": 1.0
                    },
                    "data_transforms": {
                        "parameter_multiplier": 0.001,
                        "parameter_offset": 0,
                        "parameter_offset_remove_mean": false
                    }
                },
                {
                    "title": "Swarm B altitude long-term mean",
                    "visible": true,
                    "plot_options": {
                        "plot_type": "line",
                        "stroke": "#A070DC",
                        "stroke-width": 1,
                        "stroke-opacity": "1",
                        "fill": "#A070DC",
                        "fill-opacity": 0.1,
                        "mirror_zero_x": false,
                        "curve_type": "step",
                        "baseline_mode": "constant"
                    },
                    "data": {
                        "server": "https://hapi.spaceweather.knmi.nl/hapi",
                        "dataset": "sw_fast_modb_sc_aggregate",
                        "parameter": "height_mean",
                        "time_parameter": "time",
                        "cadence_alternative_datasets_mode": "x_relations",
                        "parameter_multiplier": 1,
                        "zoom_detail_factor": 1.0
                    },
                    "data_transforms": {
                        "parameter_multiplier": 0.001,
                        "parameter_offset": 0,
                        "parameter_offset_remove_mean": false
                    }
                },
                {
                    "title": "Swarm C altitude long-term mean",
                    "visible": true,
                    "plot_options": {
                        "plot_type": "line",
                        "stroke": "#74a7fe",
                        "stroke-width": 1,
                        "stroke-opacity": "1",
                        "fill": "#74a7fe",
                        "fill-opacity": 0.1,
                        "mirror_zero_x": false,
                        "curve_type": "step",
                        "baseline_mode": "constant"
                    },
                    "data": {
                        "server": "https://hapi.spaceweather.knmi.nl/hapi",
                        "dataset": "sw_fast_modc_sc_aggregate",
                        "parameter": "height_mean",
                        "time_parameter": "time",
                        "cadence_alternative_datasets_mode": "x_relations",
                        "parameter_multiplier": 1,
                        "zoom_detail_factor": 1.0
                    },
                    "data_transforms": {
                        "parameter_multiplier": 0.001,
                        "parameter_offset": 0,
                        "parameter_offset_remove_mean": false
                    }
                },
                {
                    "title": "Swarm A altitude",
                    "visible": true,
                    "plot_options": {
                        "plot_type": "line",
                        "stroke": "#006CD9",
                        "stroke-width": 2.5,
                        "stroke-opacity": 1,
                        "fill": "#006CD9",
                        "fill-opacity": 0.16,
                        "mirror_zero_x": false,
                        "curve_type": "linear",
                        "baseline_mode": ""
                    },
                    "data": {
                        "server": "https://hapi.spaceweather.knmi.nl/hapi",
                        "dataset": "sw_fast_moda_sc",
                        "parameter": "height",
                        "time_parameter": "time",
                        "cadence_alternative_datasets_mode": "x_relations",
                        "zoom_detail_factor": 1.0
                    },
                    "data_transforms": {
                        "parameter_multiplier": 0.001,
                        "parameter_offset": 0,
                        "parameter_offset_remove_mean": false,
                        "coordinate_parameter_multiplier": 0.0001569612306
                    }
                },
                {
                    "title": "Swarm B altitude",
                    "visible": true,
                    "plot_options": {
                        "plot_type": "line",
                        "stroke": "#A070DC",
                        "stroke-width": 2.5,
                        "stroke-opacity": 1,
                        "fill": "#A070DC",
                        "fill-opacity": 0.16,
                        "mirror_zero_x": false,
                        "curve_type": "linear",
                        "baseline_mode": ""
                    },
                    "data": {
                        "server": "https://hapi.spaceweather.knmi.nl/hapi",
                        "dataset": "sw_fast_modb_sc",
                        "parameter": "height",
                        "time_parameter": "time",
                        "cadence_alternative_datasets_mode": "x_relations",
                        "zoom_detail_factor": 1.0
                    },
                    "data_transforms": {
                        "parameter_multiplier": 0.001,
                        "parameter_offset": 0,
                        "parameter_offset_remove_mean": false,
                        "coordinate_parameter_multiplier": 0.0001569612306
                    }
                },
                {
                    "title": "Swarm C altitude",
                    "visible": true,
                    "plot_options": {
                        "plot_type": "line",
                        "stroke": "#74a7fe",
                        "stroke-width": 2.5,
                        "stroke-opacity": 1,
                        "fill": "#74a7fe",
                        "fill-opacity": 0.16,
                        "mirror_zero_x": false,
                        "curve_type": "linear",
                        "baseline_mode": ""
                    },
                    "data": {
                        "server": "https://hapi.spaceweather.knmi.nl/hapi",
                        "dataset": "sw_fast_modc_sc",
                        "parameter": "height",
                        "time_parameter": "time",
                        "cadence_alternative_datasets_mode": "x_relations",
                        "zoom_detail_factor": 1.0
                    },
                    "data_transforms": {
                        "parameter_multiplier": 0.001,
                        "parameter_offset": 0,
                        "parameter_offset_remove_mean": false,
                        "coordinate_parameter_multiplier": 0.0001569612306
                    }
                }
            ]
        },
        {
            "title": "Swarm A/C FAST meridional magnetic field perturbation - ascending",
            "visible": true,
            "legend_visible": false,
            "ydomain": {
                "default": [-90, 90],
                "bounds": [-90, 90]
            },
            "y_label": "Quasi-dipole latitude",
            "scale": "linear",
            "ytick_format": "auto",
            "xaxis_annotation": "hidden",
            "yaxis_annotation": "visible",
            "height": 200,
            "annot_options": {
                "annot_horizontal_grid_lines": [
                    { "y": 0 },
                    { "y": 60 },
                    { "y": -60 },
                    { "y": -20 },
                    { "y": 20 }
                ],
                "annot_text_items": []
            },
            "margins": {
                "top": 20,
                "bottom": 10
            },
            "plot_elements": [
                {
                    "title": "Swarm A Ne 2Hz FAST data",
                    "visible": true,
                    "plot_options": {
                        "plot_type": "wiggle",
                        "stroke": "#006CD9",
                        "stroke-width": 1,
                        "stroke-opacity": 1,
                        "baseline_stroke": "#006CD9",
                        "baseline_stroke-width": 1,
                        "baseline_stroke-opacity": 0.5,
                        "fill": "#006CD9",
                        "fill-opacity": 0.16,
                        "mirror_zero_x": false,
                        "curve_type": "linear",
                        "baseline_mode": "",
                        "wiggle_scale": 0.1,
                        "z_domain_bounds": [0, 200],
                        "filter_ascending_descending": "ascending"
                    },
                    "data": {
                        "server": "https://hapi.spaceweather.knmi.nl/hapi",
                        "dataset": "sw_fast_maga_lr",
                        "parameter": "lat_qd",
                        "time_parameter": "time",
                        "z_parameter": "Delta_B_NEC_1",
                        "cadence_alternative_datasets_mode": "x_relations",
                        "parameter_multiplier": 1,
                        "zoom_detail_factor": 12.0
                    },
                    "data_transforms": {
                        "parameter_multiplier": 1,
                        "parameter_offset": 0,
                        "parameter_offset_remove_mean": false,
                        "z_parameter_multiplier": 1,
                        "z_parameter_offset": 0,
                        "z_parameter_offset_remove_mean": false
                    }
                },
                {
                    "title": "Swarm C Ne 2Hz FAST data",
                    "visible": true,
                    "plot_options": {
                        "plot_type": "wiggle",
                        "stroke": "#74a7fe",
                        "stroke-width": 1,
                        "stroke-opacity": 1,
                        "baseline_stroke": "#74a7fe",
                        "baseline_stroke-width": 1,
                        "baseline_stroke-opacity": 0.5,
                        "fill": "#74a7fe",
                        "fill-opacity": 0.16,
                        "mirror_zero_x": false,
                        "curve_type": "linear",
                        "baseline_mode": "",
                        "wiggle_scale": 0.1,
                        "z_domain_bounds": [0, 200],
                        "filter_ascending_descending": "ascending"
                    },
                    "data": {
                        "server": "https://hapi.spaceweather.knmi.nl/hapi",
                        "dataset": "sw_fast_magc_lr",
                        "parameter": "lat_qd",
                        "time_parameter": "time",
                        "z_parameter": "Delta_B_NEC_1",
                        "cadence_alternative_datasets_mode": "x_relations",
                        "parameter_multiplier": 1,
                        "zoom_detail_factor": 12.0
                    },
                    "data_transforms": {
                        "parameter_multiplier": 1,
                        "parameter_offset": 0,
                        "parameter_offset_remove_mean": false,
                        "z_parameter_multiplier": 1,
                        "z_parameter_offset": 0,
                        "z_parameter_offset_remove_mean": false
                    }
                }
            ]
        },
        {
            "title": "Swarm A/C FAST meridional magnetic field perturbation - descending",
            "visible": true,
            "legend_visible": false,
            "ydomain": {
                "default": [-90, 90],
                "bounds": [-90, 90]
            },
            "y_label": "Quasi-dipole latitude",
            "scale": "linear",
            "ytick_format": "auto",
            "xaxis_annotation": "hidden",
            "yaxis_annotation": "visible",
            "height": 200,
            "annot_options": {
                "annot_horizontal_grid_lines": [
                    { "y": 0 },
                    { "y": 60 },
                    { "y": -60 },
                    { "y": -20 },
                    { "y": 20 }
                ],
                "annot_text_items": []
            },
            "margins": {
                "top": 20,
                "bottom": 10
            },
            "plot_elements": [
                {
                    "title": "Swarm A Ne 2Hz FAST data",
                    "visible": true,
                    "plot_options": {
                        "plot_type": "wiggle",
                        "stroke": "#006CD9",
                        "stroke-width": 1,
                        "stroke-opacity": 1,
                        "baseline_stroke": "#006CD9",
                        "baseline_stroke-width": 1,
                        "baseline_stroke-opacity": 0.5,
                        "fill": "#006CD9",
                        "fill-opacity": 0.16,
                        "mirror_zero_x": false,
                        "curve_type": "linear",
                        "baseline_mode": "",
                        "wiggle_scale": 0.1,
                        "z_domain_bounds": [0, 200],
                        "filter_ascending_descending": "descending"
                    },
                    "data": {
                        "server": "https://hapi.spaceweather.knmi.nl/hapi",
                        "dataset": "sw_fast_maga_lr",
                        "parameter": "lat_qd",
                        "time_parameter": "time",
                        "z_parameter": "Delta_B_NEC_1",
                        "cadence_alternative_datasets_mode": "x_relations",
                        "parameter_multiplier": 1,
                        "zoom_detail_factor": 12.0
                    },
                    "data_transforms": {
                        "parameter_multiplier": 1,
                        "parameter_offset": 0,
                        "parameter_offset_remove_mean": false,
                        "z_parameter_multiplier": 1,
                        "z_parameter_offset": 0,
                        "z_parameter_offset_remove_mean": false
                    }
                },
                {
                    "title": "Swarm C Ne 2Hz FAST data",
                    "visible": true,
                    "plot_options": {
                        "plot_type": "wiggle",
                        "stroke": "#74a7fe",
                        "stroke-width": 1,
                        "stroke-opacity": 1,
                        "baseline_stroke": "#74a7fe",
                        "baseline_stroke-width": 1,
                        "baseline_stroke-opacity": 0.5,
                        "fill": "#74a7fe",
                        "fill-opacity": 0.16,
                        "mirror_zero_x": false,
                        "curve_type": "linear",
                        "baseline_mode": "",
                        "wiggle_scale": 0.1,
                        "z_domain_bounds": [0, 200],
                        "filter_ascending_descending": "descending"
                    },
                    "data": {
                        "server": "https://hapi.spaceweather.knmi.nl/hapi",
                        "dataset": "sw_fast_magc_lr",
                        "parameter": "lat_qd",
                        "time_parameter": "time",
                        "z_parameter": "Delta_B_NEC_1",
                        "cadence_alternative_datasets_mode": "x_relations",
                        "parameter_multiplier": 1,
                        "zoom_detail_factor": 12.0
                    },
                    "data_transforms": {
                        "parameter_multiplier": 1,
                        "parameter_offset": 0,
                        "parameter_offset_remove_mean": false,
                        "z_parameter_multiplier": 1,
                        "z_parameter_offset": 0,
                        "z_parameter_offset_remove_mean": false
                    }
                }
            ]
        },
        {
            "title": "Swarm B FAST meridional magnetic field perturbation - ascending",
            "visible": true,
            "legend_visible": false,
            "ydomain": {
                "default": [-90, 90],
                "bounds": [-90, 90]
            },
            "y_label": "Quasi-dipole latitude",
            "scale": "linear",
            "ytick_format": "auto",
            "xaxis_annotation": "hidden",
            "yaxis_annotation": "visible",
            "height": 200,
            "annot_options": {
                "annot_horizontal_grid_lines": [
                    { "y": 0 },
                    { "y": 60 },
                    { "y": -60 },
                    { "y": -20 },
                    { "y": 20 }
                ],
                "annot_text_items": []
            },
            "margins": {
                "top": 20,
                "bottom": 10
            },
            "plot_elements": [
                {
                    "title": "Swarm B Ne 2Hz FAST data",
                    "visible": true,
                    "plot_options": {
                        "plot_type": "wiggle",
                        "stroke": "#A070DC",
                        "stroke-width": 1,
                        "stroke-opacity": 1,
                        "baseline_stroke": "#A070DC",
                        "baseline_stroke-width": 1,
                        "baseline_stroke-opacity": 0.5,
                        "fill": "#A070DC",
                        "fill-opacity": 0.16,
                        "mirror_zero_x": false,
                        "curve_type": "linear",
                        "baseline_mode": "",
                        "wiggle_scale": 0.1,
                        "z_domain_bounds": [0, 200],
                        "filter_ascending_descending": "ascending"
                    },
                    "data": {
                        "server": "https://hapi.spaceweather.knmi.nl/hapi",
                        "dataset": "sw_fast_magb_lr",
                        "parameter": "lat_qd",
                        "time_parameter": "time",
                        "z_parameter": "Delta_B_NEC_1",
                        "cadence_alternative_datasets_mode": "x_relations",
                        "parameter_multiplier": 1,
                        "zoom_detail_factor": 12.0
                    },
                    "data_transforms": {
                        "parameter_multiplier": 1,
                        "parameter_offset": 0,
                        "parameter_offset_remove_mean": false,
                        "z_parameter_multiplier": 1,
                        "z_parameter_offset": 0,
                        "z_parameter_offset_remove_mean": false
                    }
                }
            ]
        },
        {
            "title": "Swarm B FAST meridional magnetic field perturbation - descending",
            "visible": true,
            "legend_visible": false,
            "ydomain": {
                "default": [-90, 90],
                "bounds": [-90, 90]
            },
            "y_label": "Quasi-dipole latitude",
            "scale": "linear",
            "ytick_format": "auto",
            "xaxis_annotation": "hidden",
            "yaxis_annotation": "visible",
            "height": 200,
            "annot_options": {
                "annot_horizontal_grid_lines": [
                    { "y": 0 },
                    { "y": 60 },
                    { "y": -60 },
                    { "y": -20 },
                    { "y": 20 }
                ],
                "annot_text_items": []
            },
            "margins": {
                "top": 20,
                "bottom": 10
            },
            "plot_elements": [
                {
                    "title": "Swarm B Ne 2Hz FAST data",
                    "visible": true,
                    "plot_options": {
                        "plot_type": "wiggle",
                        "stroke": "#A070DC",
                        "stroke-width": 1,
                        "stroke-opacity": 1,
                        "baseline_stroke": "#A070DC",
                        "baseline_stroke-width": 1,
                        "baseline_stroke-opacity": 0.5,
                        "fill": "#A070DC",
                        "fill-opacity": 0.16,
                        "mirror_zero_x": false,
                        "curve_type": "linear",
                        "baseline_mode": "",
                        "wiggle_scale": 0.1,
                        "z_domain_bounds": [0, 200],
                        "filter_ascending_descending": "descending"
                    },
                    "data": {
                        "server": "https://hapi.spaceweather.knmi.nl/hapi",
                        "dataset": "sw_fast_magb_lr",
                        "parameter": "lat_qd",
                        "time_parameter": "time",
                        "z_parameter": "Delta_B_NEC_1",
                        "cadence_alternative_datasets_mode": "x_relations",
                        "parameter_multiplier": 1,
                        "zoom_detail_factor": 12.0
                    },
                    "data_transforms": {
                        "parameter_multiplier": 1,
                        "parameter_offset": 0,
                        "parameter_offset_remove_mean": false,
                        "z_parameter_multiplier": 1,
                        "z_parameter_offset": 0,
                        "z_parameter_offset_remove_mean": false
                    }
                }
            ]
        },
        {
            "title": "Hp30 index",
            "visible": true,
            "ydomain": {
                "default": [0, "9"],
                "bounds": ["0", "15"]
            },
            "y_label": "Hp30 index",
            "scale": "linear",
            "ytick_format": "d",
            "xaxis_annotation": "visible",
            "yaxis_annotation": "visible",
            "height": 50,
            "annot_options": {
                "annot_horizontal_grid_lines": [],
                "annot_text_items": []
            },
            "margins": {
                "top": 10,
                "bottom": 40
            },
            "plot_elements": [
                {
                    "title": "Hp30 index",
                    "visible": true,
                    "plot_options": {
                        "plot_type": "bars",
                        "stroke": "#000000",
                        "stroke-width": "0",
                        "stroke-opacity": "1",
                        "fill": "#888888",
                        "fill-opacity": "1",
                        "curve_type": "linear",
                        "bar_offset_seconds": 1800,
                        "bar_padding": 0.2,
                        "bar_text": true,
                        "fill_colors": [
                            {
                                "threshold": 4.6,
                                "color": "#88CC66"
                            },
                            {
                                "threshold": 5.6,
                                "color": "#FFF033"
                            },
                            {
                                "threshold": 6.6,
                                "color": "#FFBB44"
                            },
                            {
                                "threshold": 7.6,
                                "color": "#DD9922"
                            },
                            {
                                "threshold": 8.6,
                                "color": "#FF2020"
                            },
                            {
                                "threshold": 9.6,
                                "color": "#A02020"
                            },
                            {
                                "threshold": 1000,
                                "color": "#300000"
                            }
                        ]
                    },
                    "data": {
                        "server": "https://hapi.spaceweather.knmi.nl/hapi",
                        "dataset": "hp30_index",
                        "parameter": "Hp30",
                        "time_parameter": "time",
                        "cadence_alternative_datasets_mode": "x_relations",
                        "parameter_multiplier": 1,
                        "zoom_detail_factor": 1.0
                    },
                    "data_transforms": {}
                }
            ],
            "legend_visible": false
        }
    ]
}
