{
    "options": {
        "fill_vertical": true,
        "fill_horizontal": true,
        "zoom_detail_factor": 1
    },
    "default_zoom": {
        "tmin": "2024-05-09T20:00:00.000Z",
        "tmax": "2024-05-12T00:00:00.000Z"
    },
    "global_margins": {
        "top": 0,
        "bottom": 0,
        "left": 65,
        "right": 30
    },
    "subplots": [
        {
            "title": "GOLD atomic oxygen emissions",
            "title_color": "white",
            "visible": true,
            "globe_visible": true,
            "legend_visible": false,
            "ydomain": {
                "default": [-350, 350],
                "bounds": [-500, 500]
            },
            "y_label": "",
            "scale": "linear",
            "ytick_format": "d",
            "xaxis_annotation": "hidden",
            "yaxis_annotation": "hidden",
            "height": 300,
            "annot_options": {
                "annot_horizontal_grid_lines": [],
                "annot_text_items": [],
                "annot_background_colors": [
                    {
                        "y0": -500,
                        "y1": 500,
                        "color": "#30133C"
                    }
                ]
            },
            "margins": {
                "top": 20,
                "bottom": 0
            },
            "options_3d": {
                "camera_attached_to": "Earth",
                "x_position": 0.5,
                "camera_position": [4.4616, 0, 4.8642],
                "orbit_controls_enabled": false,
                "render_earth": false,
                "clip_far": 6.7
            },
            "plot_elements": [
                {
                    "title": "GOLD 135.6 nm images - 750 R",
                    "visible": false,
                    "plot_options": {
                        "max_time_diff_before_seconds": 12000,
                        "max_time_diff_after_seconds": 0,
                        "max_retain_images": 6,
                        "image_margins": {
                            "top": 0,
                            "bottom": 30
                        },
                        "marker_color": "#ffffff",
                        "aspect_ratio": 1,
                        "color_map": "Gray",
                        "color_map_domain": {
                            "bounds": [0, 255],
                            "trim": [0, 255]
                        },
                        "reverse_color_map": false,
                        "symbol_type": "circle",
                        "symbol_height": 5,
                        "symbol_width": 5,
                        "plot_type": "epoch_image",
                        "stroke": "#000000",
                        "stroke-width": "2",
                        "stroke-opacity": "1",
                        "fill": "#888888",
                        "fill-opacity": "1",
                        "mirror_zero_x": false,
                        "curve_type": "linear",
                        "baseline_mode": ""
                    },
                    "data": {
                        "server": "https://hapi.spaceweather.knmi.nl/hapi",
                        "dataset": "gold_oi_1356_emission",
                        "parameter": "url",
                        "time_parameter": "time",
                        "cadence_alternative_datasets_mode": "off",
                        "refetch_interval_seconds": 86400,
                        "zoom_detail_factor": 3
                    },
                    "data_transforms": {
                        "parameter_multiplier": 1,
                        "parameter_offset": 0,
                        "parameter_offset_remove_mean": false,
                        "z_parameter_multiplier": 1,
                        "z_parameter_offset": 0,
                        "z_parameter_offset_remove_mean": false
                    }
                },
                {
                    "title": "GOLD 135.6 nm images - 10 000 R",
                    "visible": true,
                    "plot_options": {
                        "max_time_diff_before_seconds": 10800,
                        "max_time_diff_after_seconds": 0,
                        "max_retain_images": 6,
                        "image_margins": {
                            "top": 0,
                            "bottom": 30
                        },
                        "marker_color": "#ffffff",
                        "aspect_ratio": 1,
                        "color_map": "Gray",
                        "color_map_domain": {
                            "bounds": [0, 255],
                            "trim": [0, 255]
                        },
                        "reverse_color_map": false,
                        "symbol_type": "circle",
                        "symbol_height": 5,
                        "symbol_width": 5,
                        "plot_type": "epoch_image",
                        "stroke": "#000000",
                        "stroke-width": "2",
                        "stroke-opacity": "1",
                        "fill": "#888888",
                        "fill-opacity": "1",
                        "mirror_zero_x": false,
                        "curve_type": "linear",
                        "baseline_mode": ""
                    },
                    "data": {
                        "server": "https://hapi.spaceweather.knmi.nl/hapi",
                        "dataset": "gold_oi_1356_emission_10000",
                        "parameter": "url",
                        "time_parameter": "time",
                        "cadence_alternative_datasets_mode": "off",
                        "refetch_interval_seconds": 86400,
                        "zoom_detail_factor": 3
                    },
                    "data_transforms": {
                        "parameter_multiplier": 1,
                        "parameter_offset": 0,
                        "parameter_offset_remove_mean": false,
                        "z_parameter_multiplier": 1,
                        "z_parameter_offset": 0,
                        "z_parameter_offset_remove_mean": false
                    }
                },
                {
                    "title": "GOLD coastline image",
                    "visible": true,
                    "plot_options": {
                        "image_margins": {
                            "top": 0,
                            "bottom": 30
                        },
                        "marker_color": "#ffffff",
                        "aspect_ratio": 1,
                        "plot_type": "static_image"
                    },
                    "data": {
                        "url": "https://acc.spaceweather.knmi.nl/data/gold/static/gold_coastlines.png"
                    },
                    "data_transforms": {}
                },
                {
                    "title": "GOLD quasi-dipole coordinate graticule",
                    "visible": false,
                    "plot_options": {
                        "image_margins": {
                            "top": 0,
                            "bottom": 30
                        },
                        "marker_color": "#ffffff",
                        "aspect_ratio": 1,
                        "plot_type": "static_image"
                    },
                    "data": {
                        "url": "https://acc.spaceweather.knmi.nl/data/gold/static/gold_graticule_qd.png"
                    },
                    "data_transforms": {}
                }
            ]
        },
        {
            "title": "GFZ-Potsdam Hp30 index",
            "visible": true,
            "legend_visible": false,
            "ydomain": {
                "default": [0, "9"],
                "bounds": ["0", "15"]
            },
            "y_label": "",
            "scale": "linear",
            "ytick_format": "d",
            "xaxis_annotation": "visible",
            "yaxis_annotation": "visible",
            "height": 50,
            "annot_options": {
                "annot_horizontal_grid_lines": [],
                "annot_text_items": []
            },
            "margins": {
                "top": 10,
                "bottom": 40
            },
            "plot_elements": [
                {
                    "title": "Hp30 index",
                    "visible": true,
                    "plot_options": {
                        "plot_type": "bars",
                        "stroke": "#000000",
                        "stroke-width": "0",
                        "stroke-opacity": "1",
                        "fill": "#888888",
                        "fill-opacity": "1",
                        "curve_type": "linear",
                        "bar_offset_seconds": 1800,
                        "bar_padding": 0.2,
                        "bar_text": true,
                        "fill_colors": [
                            {
                                "threshold": 4.6,
                                "color": "#88CC66"
                            },
                            {
                                "threshold": 5.6,
                                "color": "#FFF033"
                            },
                            {
                                "threshold": 6.6,
                                "color": "#FFBB44"
                            },
                            {
                                "threshold": 7.6,
                                "color": "#DD9922"
                            },
                            {
                                "threshold": 8.6,
                                "color": "#FF2020"
                            },
                            {
                                "threshold": 9.6,
                                "color": "#A02020"
                            },
                            {
                                "threshold": 1000,
                                "color": "#300000"
                            }
                        ]
                    },
                    "data": {
                        "server": "https://hapi.spaceweather.knmi.nl/hapi",
                        "dataset": "hp30_index",
                        "parameter": "Hp30",
                        "time_parameter": "time",
                        "cadence_alternative_datasets_mode": "x_relations",
                        "refetch_interval_seconds": 600,
                        "zoom_detail_factor": 2
                    },
                    "data_transforms": {}
                }
            ]
        }
    ]
}
