{
    "id": "sunspots_silso_P1D",
    "description": "SILSO total and daily estimated sunspot number",
    "timeStampLocation": "begin",
    "resourceURL": "https://wwwbis.sidc.be/silso/datafiles",
    "resourceID": "SILSO/SIDC",
    "contact": "silso.info@oma.be",
    "contactID": "",
    "parameters": [
        {
            "name": "time",
            "type": "isotime",
            "units": "UTC",
            "fill": "",
            "description": "Time",
            "label": "",
            "key": true
        },
        {
            "name": "sunspot_number",
            "type": "double",
            "units": "",
            "fill": null,
            "description": "Sunspot number",
            "label": "",
            "key": false
        }
    ],
    "cadence": "P1D",
    "x_relations": [
        {
            "id": "sunspots_silso_P7D",
            "description": "SILSO total and daily estimated sunspot number downsampled to 7 days",
            "cadence": "P7D",
            "type": "resample",
            "method": "max",
            "add": "automatic"
        },
        {
            "id": "sunspots_silso_P27D",
            "description": "SILSO total and daily estimated sunspot number downsampled to 27 days",
            "cadence": "P27D",
            "type": "resample",
            "method": "max",
            "add": "automatic"
        },
        {
            "id": "sunspots_silso_P81D",
            "description": "SILSO total and daily estimated sunspot number downsampled to 81 days",
            "cadence": "P81D",
            "type": "resample",
            "method": "max",
            "add": "automatic"
        },
        {
            "id": "sunspots_silso_P365D",
            "description": "SILSO total and daily estimated sunspot number downsampled to 365 days",
            "cadence": "P365D",
            "type": "resample",
            "method": "max",
            "add": "automatic"
        }
    ]
}
