{
    "id": "thermosphere_gracec_PT30S",
    "description": "Thermosphere data from the GRACE C (GRACE-FO 1) satellite",
    "timeStampLocation": "begin",
    "resourceURL": "https://swarm-diss.eo.esa.int/",
    "resourceID": "ESA",
    "contact": "Christian Siemes",
    "contactID": "c.siemes@tudelft.nl",
    "parameters": [
        {
            "name": "time",
            "type": "isotime",
            "units": "UTC",
            "fill": "",
            "description": "Time",
            "label": "",
            "key": true
        },
        {
            "name": "density",
            "type": "double",
            "units": "kg/m3",
            "fill": null,
            "description": "Density",
            "label": "",
            "key": false
        },
        {
            "name": "density_orbitmean",
            "type": "double",
            "units": "kg/m3",
            "fill": null,
            "description": "Orbit mean density",
            "label": "",
            "key": false
        }
    ],
    "cadence": "PT30S",
    "x_relations": [
        {
            "id": "thermosphere_gracec_PT3M",
            "description": "Thermosphere data from the GRACE C (GRACE-FO 1) satellite downsampled to 3 minutes",
            "cadence": "PT3M",
            "type": "resample",
            "method": "mean",
            "add": "automatic"
        },
        {
            "id": "thermosphere_gracec_PT6M",
            "description": "Thermosphere data from the GRACE C (GRACE-FO 1) satellite downsampled to 6 minutes",
            "cadence": "PT6M",
            "type": "resample",
            "method": "mean",
            "add": "automatic"
        },
        {
            "id": "thermosphere_gracec_PT15M",
            "description": "Thermosphere data from the GRACE C (GRACE-FO 1) satellite downsampled to 15 minutes",
            "cadence": "PT15M",
            "type": "resample",
            "method": "mean",
            "add": "automatic"
        }
    ]
}
