{
    "id": "f10_7_P1D",
    "description": "DRAO Penticton F10.7",
    "timeStampLocation": "begin",
    "resourceURL": "https://wwwbis.sidc.be/silso/datafiles",
    "resourceID": "DRAO",
    "contact": "",
    "contactID": "",
    "parameters": [
        {
            "name": "time",
            "type": "isotime",
            "units": "UTC",
            "fill": "",
            "description": "Time",
            "label": "",
            "key": true
        },
        {
            "name": "f10_7",
            "type": "double",
            "units": "",
            "fill": null,
            "description": "Penticton noontime 10.7 cm solar radio flux",
            "label": "",
            "key": false
        }
    ],
    "cadence": "P1D",
    "x_relations": [
        {
            "id": "f10_7_P7D",
            "description": "DRAO Penticton F10.7 downsampled to 7 days",
            "cadence": "P7D",
            "type": "resample",
            "method": "max",
            "add": "automatic"
        },
        {
            "id": "f10_7_P27D",
            "description": "DRAO Penticton F10.7 downsampled to 27 days",
            "cadence": "P27D",
            "type": "resample",
            "method": "max",
            "add": "automatic"
        },
        {
            "id": "f10_7_P81D",
            "description": "DRAO Penticton F10.7 downsampled to 81 days",
            "cadence": "P81D",
            "type": "resample",
            "method": "max",
            "add": "automatic"
        },
        {
            "id": "f10_7_P365D",
            "description": "DRAO Penticton F10.7 downsampled to 365 days",
            "cadence": "P365D",
            "type": "resample",
            "method": "max",
            "add": "automatic"
        }
    ]
}
