{
    "id": "xray_flux_goes15_PT1M",
    "description": "X-ray flux from GOES-15 satellite",
    "timeStampLocation": "begin",
    "resourceURL": "https://www.ncei.noaa.gov/data/goes-space-environment-monitor/access/science/xrs/goes15/xrsf-l2-avg1m_science/sci_xrsf-l2-avg1m_g15_s20100331_e20200304_v1-0-0.nc",
    "resourceID": "NOAA NGDC",
    "contact": "",
    "contactID": "",
    "parameters": [
        {
            "name": "time",
            "type": "isotime",
            "units": "UTC",
            "fill": "",
            "description": "Time",
            "label": "",
            "key": true
        },
        {
            "name": "xray_flux_short",
            "type": "double",
            "units": "",
            "fill": null,
            "description": "Solar X-ray flux in the 0.05-0.4 nm passband",
            "label": "",
            "key": false
        },
        {
            "name": "xray_flux_long",
            "type": "double",
            "units": "",
            "fill": null,
            "description": "Solar X-ray flux in the 0.1-0.8 nm passband",
            "label": "",
            "key": false
        }
    ],
    "cadence": "PT1M",
    "x_relations": [
        {
            "id": "xray_flux_goes15_PT5M",
            "description": "X-ray flux from GOES-15 satellite downsampled to 5 minutes",
            "cadence": "PT5M",
            "type": "resample",
            "method": "max",
            "add": "automatic"
        },
        {
            "id": "xray_flux_goes15_PT30M",
            "description": "X-ray flux from GOES-15 satellite downsampled to 30 minutes",
            "cadence": "PT30M",
            "type": "resample",
            "method": "max",
            "add": "automatic"
        },
        {
            "id": "xray_flux_goes15_PT3H",
            "description": "X-ray flux from GOES-15 satellite downsampled to 3 hours",
            "cadence": "PT3H",
            "type": "resample",
            "method": "max",
            "add": "automatic"
        },
        {
            "id": "xray_flux_goes15_PT12H",
            "description": "X-ray flux from GOES-15 satellite downsampled to 12 hours",
            "cadence": "PT12H",
            "type": "resample",
            "method": "max",
            "add": "automatic"
        },
        {
            "id": "xray_flux_goes15_P3D",
            "description": "X-ray flux from GOES-15 satellite downsampled to 3 days",
            "cadence": "P3D",
            "type": "resample",
            "method": "max",
            "add": "automatic"
        },
        {
            "id": "xray_flux_goes15_P10D",
            "description": "X-ray flux from GOES-15 satellite downsampled to 10 days",
            "cadence": "P10D",
            "type": "resample",
            "method": "max",
            "add": "automatic"
        }
    ]
}
