{
    "id": "thermosphere_atmden_3h_200km_forecast_PT3H",
    "description": "DTM model density at 200 km",
    "timeStampLocation": "begin",
    "resourceURL": "",
    "resourceID": "",
    "contact": "",
    "contactID": "",
    "parameters": [
        {
            "name": "time",
            "type": "isotime",
            "units": "UTC",
            "fill": "",
            "description": "Time",
            "label": "",
            "key": true
        },
        {
            "name": "timetag_issue",
            "type": "isotime",
            "units": "UTC",
            "fill": "",
            "description": "Time of forecast issue",
            "label": "",
            "key": true
        },
        {
            "name": "min",
            "type": "double",
            "units": "kg/m3",
            "fill": null,
            "description": "Global minimum density at 200 km",
            "label": "",
            "key": false
        },
        {
            "name": "mean",
            "type": "double",
            "units": "kg/m3",
            "fill": null,
            "description": "Global mean density at 200 km",
            "label": "",
            "key": false
        },
        {
            "name": "max",
            "type": "double",
            "units": "kg/m3",
            "fill": null,
            "description": "Global maximum density at 200 km",
            "label": "",
            "key": false
        }
    ],
    "cadence": "PT3H",
    "x_relations": []
}
