{
    "id": "wam_ipe_swarmc_neutral_minmaxmean_PT1H40M",
    "description": "Thermosphere data from WAM-IPE along the Swarm C satellite track, aggregated",
    "timeStampLocation": "begin",
    "resourceURL": "https://swarm-diss.eo.esa.int/",
    "resourceID": "ESA",
    "contact": "Christian Siemes",
    "contactID": "c.siemes@tudelft.nl",
    "parameters": [
        {
            "name": "time",
            "type": "isotime",
            "units": "UTC",
            "fill": "",
            "description": "Time",
            "label": "",
            "key": true
        },
        {
            "name": "mass_density_min",
            "type": "double",
            "units": "kg/m3",
            "fill": null,
            "description": "Minimum density",
            "label": "",
            "key": false
        },
        {
            "name": "mass_density_max",
            "type": "double",
            "units": "kg/m3",
            "fill": null,
            "description": "Maximum density",
            "label": "",
            "key": false
        },
        {
            "name": "mass_density_mean",
            "type": "double",
            "units": "kg/m3",
            "fill": null,
            "description": "Mean density",
            "label": "",
            "key": false
        }
    ],
    "cadence": "PT1H40M",
    "x_relations": [
        {
            "id": "wam_ipe_swarmc_neutral_minmaxmean_PT3H",
            "description": "Thermosphere data from WAM-IPE along the Swarm C satellite track, aggregated downsampled to 3 hours",
            "cadence": "PT3H",
            "type": "resample",
            "method": "mean",
            "add": "automatic"
        },
        {
            "id": "wam_ipe_swarmc_neutral_minmaxmean_P1D",
            "description": "Thermosphere data from WAM-IPE along the Swarm C satellite track, aggregated downsampled to 1 day",
            "cadence": "P1D",
            "type": "resample",
            "method": "mean",
            "add": "automatic"
        },
        {
            "id": "wam_ipe_swarmc_neutral_minmaxmean_P3D",
            "description": "Thermosphere data from WAM-IPE along the Swarm C satellite track, aggregated downsampled to 3 days",
            "cadence": "P3D",
            "type": "resample",
            "method": "mean",
            "add": "automatic"
        },
        {
            "id": "wam_ipe_swarmc_neutral_minmaxmean_P15D",
            "description": "Thermosphere data from WAM-IPE along the Swarm C satellite track, aggregated downsampled to 15 days",
            "cadence": "P15D",
            "type": "resample",
            "method": "mean",
            "add": "automatic"
        },
        {
            "id": "wam_ipe_swarmc_neutral_minmaxmean_P27D",
            "description": "Thermosphere data from WAM-IPE along the Swarm C satellite track, aggregated downsampled to 27 days",
            "cadence": "P27D",
            "type": "resample",
            "method": "mean",
            "add": "automatic"
        }
    ]
}
