{
    "id": "thermosphere_atmden_3h_200km_nowcast_PT3H",
    "description": "DTM model density at 200 km",
    "timeStampLocation": "begin",
    "resourceURL": "",
    "resourceID": "",
    "contact": "",
    "contactID": "",
    "parameters": [
        {
            "name": "time",
            "type": "isotime",
            "units": "UTC",
            "fill": "",
            "description": "Time",
            "label": "",
            "key": true
        },
        {
            "name": "min",
            "type": "double",
            "units": "kg/m3",
            "fill": null,
            "description": "Global minimum density at 200 km",
            "label": "",
            "key": false
        },
        {
            "name": "mean",
            "type": "double",
            "units": "kg/m3",
            "fill": null,
            "description": "Global mean density at 200 km",
            "label": "",
            "key": false
        },
        {
            "name": "max",
            "type": "double",
            "units": "kg/m3",
            "fill": null,
            "description": "Global maximum density at 200 km",
            "label": "",
            "key": false
        }
    ],
    "cadence": "PT3H",
    "x_relations": [
        {
            "id": "thermosphere_atmden_3h_200km_nowcast_PT12H",
            "description": "DTM model density at 200 km ",
            "cadence": "PT12H",
            "type": "resample",
            "method": "mean",
            "add": "automatic"
        },
        {
            "id": "thermosphere_atmden_3h_200km_nowcast_P3D",
            "description": "DTM model density at 200 km ",
            "cadence": "P3D",
            "type": "resample",
            "method": "mean",
            "add": "automatic"
        }
    ]
}
