{
    "id": "hp30_index_PT30M",
    "description": "Geomagnetic Hp30 index",
    "timeStampLocation": "begin",
    "resourceURL": "https://www.gfz-potsdam.de/en/hpo-index/",
    "resourceID": "GFZ Potsdam",
    "contact": "",
    "contactID": "",
    "parameters": [
        {
            "name": "time",
            "type": "isotime",
            "units": "UTC",
            "fill": "",
            "description": "Time",
            "label": "",
            "key": true
        },
        {
            "name": "Hp30",
            "type": "double",
            "units": "",
            "fill": null,
            "description": "Geomagnetic Hp30 index",
            "label": "",
            "key": false
        }
    ],
    "cadence": "PT30M",
    "x_relations": [
        {
            "id": "hp30_index_PT3H",
            "description": "Geomagnetic Hp30 index downsampled to 3 hours",
            "cadence": "PT3H",
            "type": "resample",
            "method": "max",
            "add": "automatic"
        },
        {
            "id": "hp30_index_P1D",
            "description": "Geomagnetic Hp30 index downsampled to 1 day",
            "cadence": "P1D",
            "type": "resample",
            "method": "max",
            "add": "automatic"
        },
        {
            "id": "hp30_index_P7D",
            "description": "Geomagnetic Hp30 index downsampled to 7 days",
            "cadence": "P7D",
            "type": "resample",
            "method": "max",
            "add": "automatic"
        },
        {
            "id": "hp30_index_P31D",
            "description": "Geomagnetic Hp30 index downsampled to 31 days",
            "cadence": "P31D",
            "type": "resample",
            "method": "max",
            "add": "automatic"
        }
    ]
}
