-------------------------       
|...|......|...H..H.....|     ***
|..--..|.......H..H.....|     *g*
|......|.......H..H.....|     ***
|..-...|..|....H..H.....|        
|....-.|....-..H..H.....|        
|......|.......H..H.....|-----   
|.----------S--.---...----|..|   
|.||----   |.|--- |...|...|..|   
|.||...|   -.-.|---...|.<.H..|   
|.||...| ---.-.|---...|...H..|---|
|.||.>.--|.....|.t..-H-...|..D.|*|
|.||.....|-S-..|....|.....|..|mm!|
|.|----..|!g|..---..|-----|HH|---|
|.|   |..|!g|....|......t....|   
|.|   |..|!g|.t..|...-----...|   
|.|   |..|!g|....|...-----...| 
|.|   |..|*g|....|.....t.....| 
|.|   |..|*g|-----..-------gg| 
|.-----..---|.......|-----|..| 
|.g.......g.|----.--|gggggS..|
|...........|----.--|**???|..|
-------HH---|...|.| -------..|
      -..-  |.{.|.|      -...|
 **   -..-  |.{.|.|   *  -...|   
 **   -..-  |t{t|.|   *  -.t.|** 
      -..-  |.{.|.|      -...|** 
-------HH---|.{.|.|-------...|** 
|...............|.S..t.....|--HH--
|.------+-----+--+|-------.|.ZZZZ|
|....|.....|......|      |.+.ZZZZ|
|.&l.|.k.k.|......|      |.|.ZZZZ|
|.l&.|.k.k.|..**..|      |.|.ZZZZ|
|....|*...*|.gggg.|      |.|.ZZZZ|
-----|-----|-------      ---------