################################
#.............|###|............#
#.-------------###------------.#
#.|............###...........|.#
#.|.--+--..............G.....|.#
#.|.|...|----......---------.|.#
#.|.|.\.|...|......|...|...|.|.#
#.|.|---|.=.|---...+...|.%.|.|.#
#.|.|.%.|.l.|\.|...|.%.|...|.|.#
#.|.|...|...|..|...|...|...|.|.#
#.|.|...|...|-+-...------+--.|.#
#-|.--+---+--................|-#
###......G...................###
###..........{...<...{.......###
###..........................###
#-|.--+---+--.--...--........|-#
#.|.|...|...|.|.....|.---+--.|.#
#.|.|.k.|.G.|.|.....|.|....|.|.#
#.|.|.k.|...|.|.....|.|.G..|.|.#
#.|.|.k.|..%|.|..&..|.|....|.|.#
#.|.|.%.----|.|.....|.|.%..|.|.#
#.|.|...|.\.|.|.....|.|....|.|.#
#.|.-----...-.-------.------.|.#
#.|.....--+--................|.#
#.|..........................|.#
#.-------------###------------.#
#.............-###-............#
###############################>