################################
#-#--------------------------#-#
##.|..|.\|....G....|..|..|..|.##
#|.|..|..|..|---|..|.\|..|..|.|#
#|.+..|..|..+...+..|..|..|..+.|#
#|.----+-----...----+---+----.|#
##............................##
##...............G............##
##............................##
#|.--+-----+-......-+--+-+-+-.|#
#|.|..|..|..|.....{|.ww.|...|.|#
#|.|.G|..|.G|...<..|....|...|.|#
#|.----+-----......|.._.|.@.|.|#
##.............{...|....|...|.|#
##.......G.........|..G.|...|.|#
##.................|....|...|.|#
#|.------+-+-----.----------|.|#
#|.+....|...|...+.+....|....+.|#
#|.|...@|...|.@.|.|.l..|@...|.|#
#|.|....|...|...|.|....|..G.|.|#
#|.|....|...|...|.|..=.|....|.|#
#|.+....|...|...+.+....|....+.|#
#|.--------------.-----------.|#
#|............................|#
#|.........G..................|#
##............................##
#-#--------------#-----------#-#
###############################>