################################
#------------------------------#
################################
###.......#####}{}###........###
##..................G.........##
#|.-------+-----------..-----.|#
#|.|....|..|...|.....|..+...|.|#
#|.|..=.|..|...|.....|..|...|.|#
#|.|.l..|..|...|.....|..|...|.|#
#|.|....|..|...|.n...+..|..@|.|#
#|.-+--+---|...|+----|..+...|.|#
#|......|..|...|.|.\.|.--...|.|#
#|...G..|..|...|.|...|.|..G.|.|#
#|......|..|...|.|...|.-----|.|#
#|......|..|...|.|...|.|....|.|#
#|.----.|..|+-+-.|...|.+....|.|#
#|.|\.|.--+-..{..--+--.|.._.|.|#
#|.|..+......<.......-.|ww..|.|#
#|.|---+-+-.----+--....+....|.|#
#|.|..|...|.+..|..|-+-------|.|#
#|.|..|...|.|G.|..|..|..|G..|.|#
#|.|@.|...|.+..|@.|..|.\|@..|.|#
#|.|..|.@.|.---|..|..|..|...+.|#
#|.-+------..{.--------+-----.|#
##.....G......................##
##..................G.........##
#------------------------------#
###############################>