                         ---------     -----|
                         |.......|     |....|
     ---------        ----.......-------....|
     |w......|        |............g.g......|
     |......-------   |--...........<.......|
     |..--........-----............g.g......|
     --..--.-----........|..................|
      --..--.*| -----------.................|
       |...--.|    |**Sm..S..............---|
      ----..-----  ------------........--- -
      |.........--            ----------    
     --.....-S-..--                         
  ----..|..--.--..---------------------     
---....-----|.|--..|......|...........---   
|...g...|   |.| --.S......|...>......l..Sm* 
---.--.--   |.|  ----.....|......|....---   
  |....S*.  |.|     |............|..|..|    
  --.---    |.|     --------.-----------    
   |.---|---|.---       ----.--  
   |........|...|   *   |.....|*  
   |----|.......|   *   |--...-S-
        |.....-S-   *  --.......|
        |..g..|*       |.......--
        |.....|.       |.-..----
        |...--|        |-..--
        |.---.----------..--
        |................--
        |-----------...--|
                  ---...-- -----
          --------  --...---...--
         --......--  ---.....g..|
         |...lw...|    |.......--
         --......-|    |--..---- 
          ------..------...--    
             .*S...........|     
               -------------     