################################
#--##########################--#
#--..........................--#
##............................##
##.....G.........G............##
##.----.-----.---+--...-----..##
##.|..|.|...|.|....|...|.w.|..##
##.|.\|.|...+.+.G..|...|.l.|..##
##.|..|.|._.|.|...\|...|.=.|..##
##.-+-|.|...|.-------..|...|..##
##....|.|...+....|..|..-+-+-..##
##....-.----|....|.@|.........##
##....-..G.......+..|.........##
##...............|..|.....G...##
##.{...G.---|....|..|.........##
##..<....+..|-+-.|..|...-----.##
##.......|..|..|.----...|...|.##
##....-..|..|..|.....G..|...|.##
##.--+|.----|..|+--.....+..@|.##
##.|..|.+...|--|..|---..-----.##
##.|\.|.|..@|..|@.|..+........##
##.|..|.+...|..|..|..+........##
##.----.-----+--------......{.##
##............................##
##......G.............G.......##
#--..........................--#
#--##########################--#
###############################>