{
  "HALProvider": {
    "Other Devices": {
      "Talon SRX[0]": {
        "header": {
          "open": true
        }
      },
      "Victor SPX[4]": {
        "header": {
          "open": true
        }
      },
      "Victor SPX[5]": {
        "header": {
          "open": true
        }
      }
    },
    "PWM Outputs": {
      "window": {
        "visible": true
      }
    },
    "RoboRIO": {
      "window": {
        "visible": true
      }
    }
  },
  "NTProvider": {
    "types": {
      "/FMSInfo": "FMSInfo",
      "/LiveWindow/ClimbSubsystem": "Subsystem",
      "/LiveWindow/ConveyorSubsystem": "Subsystem",
      "/LiveWindow/DriveSubsystem": "Subsystem",
      "/LiveWindow/InputSubsystem": "Subsystem",
      "/LiveWindow/Ungrouped/DifferentialDrive[1]": "DifferentialDrive",
      "/LiveWindow/Ungrouped/MotorControllerGroup[1]": "Motor Controller",
      "/LiveWindow/Ungrouped/MotorControllerGroup[2]": "Motor Controller",
      "/LiveWindow/Ungrouped/MotorControllerGroup[3]": "Motor Controller",
      "/LiveWindow/Ungrouped/PIDController[1]": "PIDController",
      "/LiveWindow/Ungrouped/PIDController[2]": "PIDController",
      "/LiveWindow/Ungrouped/Scheduler": "Scheduler",
      "/LiveWindow/Ungrouped/Victor SPX [4]": "Motor Controller",
      "/LiveWindow/Ungrouped/Victor SPX [5]": "Motor Controller",
      "/LiveWindow/VelocityControlledMotor": "Subsystem",
      "/LiveWindow/VelocityControlledMotor/PID Controller": "PIDController"
    }
  }
}
