ref.,name,price,release-date
IEL-51619,Ishtar - Les Jardins de Babylone,10.0,2019-10-04
BLU-KIN01,Kingdomino,19.90,2016-10-21
BO-DRA01,Draftosaurus,19.90,2019-02-22
FLY004JU,Jurassic Snackk,19.90,2018-04-06
Spam,Lovely Spam,Wonderful Spam
Spam,Lovely Spam,Wonderful Spam
Spam,Lovely Spam,Wonderful Spam

Spam,Lovely Spam,Wonderful Spam

