id,name,model_id/id,group_id/id,perm_read,perm_write,perm_create,perm_unlink
sale_module_super_user_group_sale_department_module,sale_module_super_user_group_sale_department_module,model_sale_module_department,sale_module_super_user_group,1,1,1,1
sale_module_manager_group_sale_department_module,sale_module_manager_group_sale_department_module,model_sale_module_department,sale_module_manager_group,1,1,0,0

sale_module_super_user_group_sale_brand_module,sale_module_super_user_group_sale_brand_module,model_sale_module_brand,sale_module_super_user_group,1,1,1,1
sale_module_user_group_sale_brand_module,sale_module_user_group_sale_brand_module,model_sale_module_brand,sale_module_manager_group,1,1,0,0


