{
  "Test1": {
    "input": {
      "a": 2,
      "b": 6
    },
    "expected": false
  },
  "Test2": {
    "input": {
      "a": 2,
      "b": 3
    },
    "expected": true
  },
  "Test3": {
    "input": {
      "a": 2,
      "b": 10
    },
    "expected": false
  },
  "Test4": {
    "input": {
      "a": 0,
      "b": 1
    },
    "expected": true
  },
  "Test5": {
    "input": {
      "a": 3,
      "b": 1
    },
    "expected": true
  },
  "Test6": {
    "input": {
      "a": 10,
      "b": 10
    },
    "expected": false
  },
  "Test7": {
    "input": {
      "a": 5,
      "b": 10
    },
    "expected": true
  },
  "Test8": {
    "input": {
      "a": 6,
      "b": 10
    },
    "expected": false
  },
  "Test9": {
    "input": {
      "a": 10,
      "b": 0
    },
    "expected": true
  },
  "Test10": {
    "input": {
      "a": 5,
      "b": 5
    },
    "expected": false
  }
}