{
  "Test1": {
    "input": {
      "deposit": 100,
      "rate": 20,
      "threshold": 170
    },
    "expected": 3
  },
  "Test2": {
    "input": {
      "deposit": 100,
      "rate": 1,
      "threshold": 101
    },
    "expected": 1
  },
  "Test3": {
    "input": {
      "deposit": 1,
      "rate": 100,
      "threshold": 64
    },
    "expected": 6
  },
  "Test4": {
    "input": {
      "deposit": 20,
      "rate": 20,
      "threshold": 50
    },
    "expected": 6
  },
  "Test5": {
    "input": {
      "deposit": 50,
      "rate": 25,
      "threshold": 100
    },
    "expected": 4
  }
}