{
  "Test1": {
    "input": "00-1B-63-84-45-E6",
    "expected": true
  },
  "Test2": {
    "input": "Z1-1B-63-84-45-E6",
    "expected": false
  },
  "Test3": {
    "input": "not a MAC-48 address",
    "expected": false
  },
  "Test4": {
    "input": "FF-FF-FF-FF-FF-FF",
    "expected": true
  },
  "Test5": {
    "input": "00-00-00-00-00-00",
    "expected": true
  },
  "Test6": {
    "input": "G0-00-00-00-00-00",
    "expected": false
  },
  "Test7": {
    "input": "02-03-04-05-06-07-",
    "expected": false
  },
  "Test8": {
    "input": "12-34-56-78-9A-BC",
    "expected": true
  },
  "Test9": {
    "input": "FF-FF-AB-CD-EA-BC",
    "expected": true
  },
  "Test10": {
    "input": "12-34-56-78-9A-BG",
    "expected": false
  }
}