{
  "Test1": {
    "input": {
      "n": 3,
      "m": 10
    },
    "expected": 9
  },
  "Test2": {
    "input": {
      "n": 1,
      "m": 2
    },
    "expected": 2
  },
  "Test3": {
    "input": {
      "n": 10,
      "m": 5
    },
    "expected": 0
  },
  "Test4": {
    "input": {
      "n": 4,
      "m": 4
    },
    "expected": 4
  },
  "Test5": {
    "input": {
      "n": 4,
      "m": 15
    },
    "expected": 12
  },
  "Test6": {
    "input": {
      "n": 9,
      "m": 100
    },
    "expected": 99
  },
  "Test7": {
    "input": {
      "n": 8,
      "m": 2
    },
    "expected": 0
  },
  "Test8": {
    "input": {
      "n": 3,
      "m": 3
    },
    "expected": 3
  },
  "Test9": {
    "input": {
      "n": 7,
      "m": 10
    },
    "expected": 7
  },
  "Test10": {
    "input": {
      "n": 3,
      "m": 23
    },
    "expected": 21
  }
}