{
  "Test1": {
    "input": 2,
    "expected": 99
  },
  "Test2": {
    "input": 1,
    "expected": 9
  },
  "Test3": {
    "input": 7,
    "expected": 9999999
  },
  "Test4": {
    "input": 4,
    "expected": 9999
  },
  "Test5": {
    "input": 3,
    "expected": 999
  }
}