0.300804556803152,0.629351385191891
0.401498616534626,0.710083908713805
0.501347133456742,0.779766124540409
0.601216068316016,0.840056089274427
0.700227449814662,0.894820599897009
0.80099837707426,0.940194060482134
0.901792124381269,0.975070299257898
1,1
