<?xml version="1.0" encoding="iso-8859-1"?>
<!-- Uploaded to: SVG Repo, www.svgrepo.com, Generator: SVG Repo Mixer Tools -->
<svg fill="rgb(23, 108, 218)" height="30px" width="30px" version="1.1" id="Layer_1" xmlns="http://www.w3.org/2000/svg" xmlns:xlink="http://www.w3.org/1999/xlink" 
	 viewBox="0 0 476.213 476.213" xml:space="preserve">
<polygon points="476.213,223.107 57.427,223.107 151.82,128.713 130.607,107.5 0,238.106 130.607,368.714 151.82,347.5 
	57.427,253.107 476.213,253.107 "/>
</svg>