[
  {
    "id": "ebc8ef10-f469-4db3-b5ec-0ceedd8ba72a",
    "name": "ryan",
    "password": "$2b$10$TVV7OZpRdcfqZztaVn3XHOrxNss7ZdbVYt9FLPq.VOXtv1hcS2J1a",
    "email": "ryan@gmail.com"
  },
  {
    "id": "52df2272-3412-49a3-9482-67b039c59ba7",
    "name": "tyson",
    "password": "$2b$10$HFf6EzMzOsOpn.LEDPYwgucQUieCqqjsFGewcNaIdRb0Q2R/7aPee",
    "email": "tyson@gmail.com"
  },
  {
    "id": "4346b480-b962-4c88-96e8-f0c995cda753",
    "name": "ryangonalez",
    "password": "$2b$10$5D/m1zrEOC.XOMR1yxagz.gSb7rbmNR6h.7z/hjXNq7PeLpzEtcAu",
    "email": "ryan@gmail.com"
  },
  {
    "id": "fa6221b8-2f1a-4af8-976a-0af3ca897178",
    "name": "ryan",
    "password": "$2b$10$m9v6AjrLoV8MVanCKMOeRuXXIBFa49rFgVrqtfFZFYmI28HanXYTC",
    "email": "ryan@gmail.com"
  },
  {
    "id": "9ec4b628-47c6-48b5-a7b6-414db575a52c",
    "name": "love",
    "password": "$2b$10$Rd0DYLUn6DL7FcSzcilEX.tZ1M5URCBY26A9Ric2U46pFKwjDi6VW",
    "email": "love@gmail.com"
  },
  {
    "id": "85a9dc7c-9297-443a-93a5-507c455aa5b8",
    "name": "Jonathan Francis",
    "password": "$2b$10$.vQRMbI/QSQvjYBVA.HzVecv5bWJTJgisn8e3Qk2JNpdnnHPX3JhG",
    "email": "jjonathan.francis@gmail.com"
  },
  {
    "id": "3d9bd7cf-da93-4d7f-9315-7b5284ee9ee7",
    "name": "Jonathan Francis",
    "password": "$2b$10$jPalHz/zZrNAWT0Cf9woa.LRb09zpZjoVlXi41bB.1fbAq8Rzr1H2",
    "email": "tonyman@gmail.com"
  },
  {
    "id": "6b0401f6-fc25-46b7-8e99-021fdc93dd0f",
    "name": "Tony Jahamon",
    "password": "$2b$10$Hcf1IWnv1iawWBNCPGd5N.VvomNcoPpYYk/Q25kRZ1p7cvSNJ5dTK",
    "email": "yahoo@gmail.com"
  },
  {
    "id": "1a429944-5112-41a6-9a54-ecbb0d6da019",
    "name": "Tony",
    "password": "$2b$10$/jXAOozNTjo/QxxRux8By.ivzasdsoI6uirsnc2rKUZNkWHQvawUW",
    "email": "yahoo@gmail.com"
  },
  {
    "id": "a7186a14-8393-4a04-8bf2-09a339980359",
    "name": "jaxson",
    "password": "$2b$10$.FGyJu5zOMgdDeMoMfxE0e.wB04.N.xom7DoJJmUPiKPOmXd9CcSW",
    "email": "yahooman@gmail.com"
  },
  {
    "id": "7ccb764d-3f4d-441d-8d80-3e107d40a900",
    "name": "Yo man",
    "password": "$2b$10$92Rvp52A0LFZeulo532HtuDkpt1k6fVttGp1P9nvTbs35VOzcxJqu",
    "email": "gmail@yahoo.com"
  }
]