{
    "0": "Alerte \u00e0 Malibu (cocktail de la couleurs des fameux maillots de bains... ou presque)",
    "1": "Aperol Spritz : cocktail italien p\u00e9tillant",
    "3": "Black velvet",
    "7": "Ca\u00efpirinha",
    "31": "Cocktail au kumquat et au litchi"
}