\relax 
\providecommand\hyper@newdestlabel[2]{}
\@writefile{toc}{\contentsline {part}{\numberline {I}User Guide}{1}{part.1}\protected@file@percent }
\newlabel{chap:UserGuide}{{I}{2}{User Guide}{part.1}{}}
\@writefile{toc}{\contentsline {chapter}{\numberline {1}Dc43 Implementation}{2}{chapter.1}\protected@file@percent }
\@writefile{lof}{\addvspace {10\p@ }}
\@writefile{lot}{\addvspace {10\p@ }}
\@writefile{toc}{\contentsline {section}{\numberline {1.1}Class Diagram}{2}{section.1.1}\protected@file@percent }
\@writefile{lof}{\contentsline {figure}{\numberline {1.1}{\ignorespaces class diagram\relax }}{2}{figure.caption.1}\protected@file@percent }
\providecommand*\caption@xref[2]{\@setref\relax\@undefined{#1}}
\newlabel{fig:classdiagrammdc43}{{1.1}{2}{class diagram\relax }{figure.caption.1}{}}
\@writefile{toc}{\contentsline {subsection}{\numberline {1.1.1}Dc43Material}{3}{subsection.1.1.1}\protected@file@percent }
\@writefile{toc}{\contentsline {subsection}{\numberline {1.1.2}Dc43PredefinedMaterial}{3}{subsection.1.1.2}\protected@file@percent }
\@writefile{toc}{\contentsline {subsection}{\numberline {1.1.3}Dc43PredefinedMetal/Dc43PredefinedPlastic/...}{4}{subsection.1.1.3}\protected@file@percent }
\@writefile{lot}{\contentsline {table}{\numberline {1.1}{\ignorespaces Attribute conventions Dc43PredefindedMetal\relax }}{4}{table.caption.5}\protected@file@percent }
\@writefile{lot}{\contentsline {table}{\numberline {1.2}{\ignorespaces Attribute conventions Dc43PredefinedPlastic\relax }}{4}{table.caption.6}\protected@file@percent }
\@writefile{toc}{\contentsline {subsection}{\numberline {1.1.4}Dc43MaterialProperty}{4}{subsection.1.1.4}\protected@file@percent }
\@writefile{lot}{\contentsline {table}{\numberline {1.3}{\ignorespaces \textit  {MaterialPropertyCategory} and corresponding property classes\relax }}{5}{table.caption.7}\protected@file@percent }
\newlabel{table:materialpropertyclasses}{{1.3}{5}{\textit {MaterialPropertyCategory} and corresponding property classes\relax }{table.caption.7}{}}
\@writefile{toc}{\contentsline {subsubsection}{\numberline {1.1.4.1}Example}{5}{subsubsection.1.1.4.1}\protected@file@percent }
\@writefile{lof}{\contentsline {figure}{\numberline {1.2}{\ignorespaces new general property added\relax }}{6}{figure.caption.9}\protected@file@percent }
\newlabel{fig:examplepropertycraetion1}{{1.2}{6}{new general property added\relax }{figure.caption.9}{}}
\@writefile{lof}{\contentsline {figure}{\numberline {1.3}{\ignorespaces material with general property\relax }}{6}{figure.caption.10}\protected@file@percent }
\newlabel{fig:examplepropertycraetion2}{{1.3}{6}{material with general property\relax }{figure.caption.10}{}}
\@writefile{toc}{\contentsline {section}{\numberline {1.2}Usage in graphical rules}{6}{section.1.2}\protected@file@percent }
\@writefile{toc}{\contentsline {chapter}{\numberline {2}Dc43 Usage Examples}{7}{chapter.2}\protected@file@percent }
\@writefile{lof}{\addvspace {10\p@ }}
\@writefile{lot}{\addvspace {10\p@ }}
\@writefile{toc}{\contentsline {section}{\numberline {2.1}Different Material Classes}{7}{section.2.1}\protected@file@percent }
\newlabel{ex:materialclasses}{{2.1}{7}{Different Material Classes}{section.2.1}{}}
\@writefile{toc}{\contentsline {subsection}{\numberline {2.1.1}as Dc43Material}{7}{subsection.2.1.1}\protected@file@percent }
\newlabel{subsec:dc43material}{{2.1.1}{7}{as Dc43Material}{subsection.2.1.1}{}}
\@writefile{lof}{\contentsline {figure}{\numberline {2.1}{\ignorespaces material as Dc43Material\relax }}{7}{figure.caption.11}\protected@file@percent }
\newlabel{fig:exampledc43material}{{2.1}{7}{material as Dc43Material\relax }{figure.caption.11}{}}
\@writefile{toc}{\contentsline {subsection}{\numberline {2.1.2}as Dc43PredefinedMaterial}{8}{subsection.2.1.2}\protected@file@percent }
\@writefile{lof}{\contentsline {figure}{\numberline {2.2}{\ignorespaces material as Dc43PredefinedMaterial\relax }}{8}{figure.caption.12}\protected@file@percent }
\newlabel{fig:exampledc43predefinedmaterial}{{2.2}{8}{material as Dc43PredefinedMaterial\relax }{figure.caption.12}{}}
\@writefile{toc}{\contentsline {subsection}{\numberline {2.1.3}as Dc43Metal}{8}{subsection.2.1.3}\protected@file@percent }
\@writefile{lof}{\contentsline {figure}{\numberline {2.3}{\ignorespaces material as Dc43Metal\relax }}{8}{figure.caption.13}\protected@file@percent }
\newlabel{fig:exampledc43metal}{{2.3}{8}{material as Dc43Metal\relax }{figure.caption.13}{}}
\@writefile{toc}{\contentsline {subsection}{\numberline {2.1.4}as Dc43Plastic}{8}{subsection.2.1.4}\protected@file@percent }
\@writefile{toc}{\contentsline {section}{\numberline {2.2}Graphical Rule Example}{9}{section.2.2}\protected@file@percent }
\newlabel{ex:graphicalrule}{{2.2}{9}{Graphical Rule Example}{section.2.2}{}}
\@writefile{lof}{\contentsline {figure}{\numberline {2.4}{\ignorespaces class diagram to add material to\relax }}{9}{figure.caption.14}\protected@file@percent }
\newlabel{fig:examplegraphicalusage1}{{2.4}{9}{class diagram to add material to\relax }{figure.caption.14}{}}
\@writefile{lof}{\contentsline {figure}{\numberline {2.5}{\ignorespaces added material link\relax }}{9}{figure.caption.15}\protected@file@percent }
\newlabel{fig:examplegraphicalusage2}{{2.5}{9}{added material link\relax }{figure.caption.15}{}}
\@writefile{lof}{\contentsline {figure}{\numberline {2.6}{\ignorespaces added material to instance\relax }}{10}{figure.caption.16}\protected@file@percent }
\newlabel{fig:examplegraphicalusage3}{{2.6}{10}{added material to instance\relax }{figure.caption.16}{}}
\@writefile{lof}{\contentsline {figure}{\numberline {2.7}{\ignorespaces GUI open\relax }}{10}{figure.caption.17}\protected@file@percent }
\newlabel{fig:examplegraphicalusage4}{{2.7}{10}{GUI open\relax }{figure.caption.17}{}}
\@writefile{lof}{\contentsline {figure}{\numberline {2.8}{\ignorespaces filled out attributes\relax }}{11}{figure.caption.18}\protected@file@percent }
\newlabel{fig:examplegraphicalusage5}{{2.8}{11}{filled out attributes\relax }{figure.caption.18}{}}
\@writefile{lof}{\contentsline {figure}{\numberline {2.9}{\ignorespaces final graph\relax }}{11}{figure.caption.19}\protected@file@percent }
\newlabel{fig:examplegraphicalusage6}{{2.9}{11}{final graph\relax }{figure.caption.19}{}}
\@writefile{toc}{\contentsline {section}{\numberline {2.3}Accessing the Dc43Property class values}{12}{section.2.3}\protected@file@percent }
\newlabel{ex:dc43propertyclass}{{2.3}{12}{Accessing the Dc43Property class values}{section.2.3}{}}
\@writefile{toc}{\contentsline {chapter}{\numberline {3}Material Database GUI}{13}{chapter.3}\protected@file@percent }
\@writefile{lof}{\addvspace {10\p@ }}
\@writefile{lot}{\addvspace {10\p@ }}
\newlabel{ch:guiusage}{{3}{13}{Material Database GUI}{chapter.3}{}}
\newlabel{fig:databaseparts}{{3.1}{13}{}{figure.caption.20}{}}
\@writefile{toc}{\contentsline {section}{\numberline {3.1}Material Tree}{14}{section.3.1}\protected@file@percent }
\newlabel{sec:materialtree}{{3.1}{14}{Material Tree}{section.3.1}{}}
\@writefile{toc}{\contentsline {subsection}{\numberline {3.1.1}Elements}{14}{subsection.3.1.1}\protected@file@percent }
\@writefile{toc}{\contentsline {subsection}{\numberline {3.1.2}Right click menu}{14}{subsection.3.1.2}\protected@file@percent }
\newlabel{fig:databasetreerightclick}{{3.2}{15}{}{figure.caption.21}{}}
\@writefile{toc}{\contentsline {section}{\numberline {3.2}General View}{16}{section.3.2}\protected@file@percent }
\newlabel{sec:generalview}{{3.2}{16}{General View}{section.3.2}{}}
\@writefile{toc}{\contentsline {section}{\numberline {3.3}Properties View}{16}{section.3.3}\protected@file@percent }
\@writefile{toc}{\contentsline {subsection}{\numberline {3.3.1}Property Category Tab-Bar}{16}{subsection.3.3.1}\protected@file@percent }
\newlabel{propertiesTabBar}{{3.3.1}{16}{Property Category Tab-Bar}{subsection.3.3.1}{}}
\newlabel{fig:propertyviewrightclick}{{3.3}{17}{}{figure.caption.22}{}}
\@writefile{toc}{\contentsline {subsection}{\numberline {3.3.2}Actions Menu-Bar}{18}{subsection.3.3.2}\protected@file@percent }
\newlabel{actionsMenuBar}{{3.3.2}{18}{Actions Menu-Bar}{subsection.3.3.2}{}}
\@writefile{toc}{\contentsline {chapter}{\numberline {4}GUI Example}{19}{chapter.4}\protected@file@percent }
\@writefile{lof}{\addvspace {10\p@ }}
\@writefile{lot}{\addvspace {10\p@ }}
\newlabel{ex:guiusage}{{4}{19}{GUI Example}{chapter.4}{}}
\@writefile{toc}{\contentsline {section}{\numberline {4.1}create a new material}{19}{section.4.1}\protected@file@percent }
\newlabel{fig:databaseaddmaterialexample2}{{4.1}{19}{}{figure.caption.23}{}}
\newlabel{fig:databaseaddmaterialexample}{{4.2}{19}{}{figure.caption.24}{}}
\newlabel{fig:databaseexamplegui1}{{4.3}{20}{}{figure.caption.25}{}}
\@writefile{lof}{\contentsline {figure}{\numberline {4.4}{\ignorespaces Metal folder created\relax }}{21}{figure.caption.26}\protected@file@percent }
\newlabel{fig:databaseexamplegui2}{{4.4}{21}{Metal folder created\relax }{figure.caption.26}{}}
\newlabel{fig:databaseexamplegui3}{{4.5}{21}{}{figure.caption.27}{}}
\@writefile{lof}{\contentsline {figure}{\numberline {4.6}{\ignorespaces material is created\relax }}{22}{figure.caption.28}\protected@file@percent }
\newlabel{fig:databaseexamplegui4}{{4.6}{22}{material is created\relax }{figure.caption.28}{}}
\@writefile{lof}{\contentsline {figure}{\numberline {4.7}{\ignorespaces \relax }}{22}{figure.caption.29}\protected@file@percent }
\newlabel{fig:databaseexamplegui5}{{4.7}{22}{\relax }{figure.caption.29}{}}
\newlabel{fig:databaseexamplegui6}{{\caption@xref {fig:databaseexamplegui6}{ on input line 422}}{23}{create a new material}{figure.caption.30}{}}
\newlabel{fig:databaseexamplegui7}{{\caption@xref {fig:databaseexamplegui7}{ on input line 429}}{23}{create a new material}{figure.caption.31}{}}
\newlabel{fig:databaseexamplegui8}{{\caption@xref {fig:databaseexamplegui8}{ on input line 439}}{24}{create a new material}{figure.caption.32}{}}
\newlabel{fig:databaseexamplegui9}{{\caption@xref {fig:databaseexamplegui9}{ on input line 448}}{25}{create a new material}{figure.caption.33}{}}
\newlabel{fig:databaseexamplegui10}{{\caption@xref {fig:databaseexamplegui10}{ on input line 454}}{25}{create a new material}{figure.caption.34}{}}
\newlabel{fig:databaseexamplegui11}{{\caption@xref {fig:databaseexamplegui11}{ on input line 460}}{26}{create a new material}{figure.caption.35}{}}
\@setckpt{UserGuide}{
\setcounter{page}{27}
\setcounter{equation}{0}
\setcounter{enumi}{0}
\setcounter{enumii}{0}
\setcounter{enumiii}{0}
\setcounter{enumiv}{0}
\setcounter{footnote}{0}
\setcounter{mpfootnote}{0}
\setcounter{part}{1}
\setcounter{chapter}{4}
\setcounter{section}{1}
\setcounter{subsection}{0}
\setcounter{subsubsection}{0}
\setcounter{paragraph}{0}
\setcounter{subparagraph}{0}
\setcounter{figure}{7}
\setcounter{table}{0}
\setcounter{Item}{0}
\setcounter{Hfootnote}{0}
\setcounter{bookmark@seq@number}{0}
\setcounter{FancyVerbLine}{0}
\setcounter{parentequation}{0}
\setcounter{caption@flags}{0}
\setcounter{continuedfloat}{0}
\setcounter{lofdepth}{1}
\setcounter{lotdepth}{1}
\setcounter{float@type}{4}
\setcounter{AM@survey}{0}
\setcounter{subfigure}{0}
\setcounter{subtable}{0}
\setcounter{r@tfl@t}{0}
\setcounter{LT@tables}{0}
\setcounter{LT@chunks}{0}
\setcounter{section@level}{1}
}
