\relax 
\providecommand\hyper@newdestlabel[2]{}
\@writefile{toc}{\contentsline {part}{\numberline {II}Programmers Guide}{1}{part.2}\protected@file@percent }
\newlabel{chap:ProgrammersGuide}{{II}{2}{Programmers Guide}{part.2}{}}
\@writefile{toc}{\contentsline {chapter}{\numberline {5}General}{2}{chapter.5}\protected@file@percent }
\@writefile{lof}{\addvspace {10\p@ }}
\@writefile{lot}{\addvspace {10\p@ }}
\newlabel{ch:general}{{5}{2}{General}{chapter.5}{}}
\@writefile{toc}{\contentsline {section}{\numberline {5.1}Main Structure}{2}{section.5.1}\protected@file@percent }
\newlabel{sec:mainstructure}{{5.1}{2}{Main Structure}{section.5.1}{}}
\@writefile{lof}{\contentsline {figure}{\numberline {5.1}{\ignorespaces MVC structure class diagram\relax }}{2}{figure.caption.36}\protected@file@percent }
\newlabel{fig:modelgoontest}{{5.1}{2}{MVC structure class diagram\relax }{figure.caption.36}{}}
\@writefile{toc}{\contentsline {subsection}{\numberline {5.1.1}Model}{3}{subsection.5.1.1}\protected@file@percent }
\newlabel{sec:model}{{5.1.1}{3}{Model}{subsection.5.1.1}{}}
\@writefile{lof}{\contentsline {figure}{\numberline {5.2}{\ignorespaces graph element classes\relax }}{4}{figure.caption.38}\protected@file@percent }
\newlabel{fig:graphelementsclasses}{{5.2}{4}{graph element classes\relax }{figure.caption.38}{}}
\@writefile{toc}{\contentsline {subsubsection}{\numberline {5.1.1.1}SimpleModel}{4}{subsubsection.5.1.1.1}\protected@file@percent }
\newlabel{sub:simplemodel}{{5.1.1.1}{4}{SimpleModel}{subsubsection.5.1.1.1}{}}
\@writefile{lof}{\contentsline {figure}{\numberline {5.3}{\ignorespaces simple model class structure\relax }}{5}{figure.caption.39}\protected@file@percent }
\newlabel{fig:simplemodelclasses}{{5.3}{5}{simple model class structure\relax }{figure.caption.39}{}}
\@writefile{toc}{\contentsline {subsection}{\numberline {5.1.2}DataFiles/DataFileHandler}{5}{subsection.5.1.2}\protected@file@percent }
\newlabel{sub:datafilehandler}{{5.1.2}{5}{DataFiles/DataFileHandler}{subsection.5.1.2}{}}
\@writefile{toc}{\contentsline {subsection}{\numberline {5.1.3}View/SimpleView}{6}{subsection.5.1.3}\protected@file@percent }
\@writefile{lof}{\contentsline {figure}{\numberline {5.4}{\ignorespaces view implementation\relax }}{6}{figure.caption.40}\protected@file@percent }
\newlabel{fig:view-classes}{{5.4}{6}{view implementation\relax }{figure.caption.40}{}}
\@writefile{toc}{\contentsline {subsection}{\numberline {5.1.4}Controller/SimpleController}{7}{subsection.5.1.4}\protected@file@percent }
\@writefile{toc}{\contentsline {subsection}{\numberline {5.1.5}Dc43 implementation/MaterialDataBaseStarter}{7}{subsection.5.1.5}\protected@file@percent }
\newlabel{sub:dc43implementation}{{5.1.5}{7}{Dc43 implementation/MaterialDataBaseStarter}{subsection.5.1.5}{}}
\@writefile{lof}{\contentsline {figure}{\numberline {5.5}{\ignorespaces material database starter implementation\relax }}{7}{figure.caption.41}\protected@file@percent }
\newlabel{fig:materialdatabasestarter}{{5.5}{7}{material database starter implementation\relax }{figure.caption.41}{}}
\@writefile{toc}{\contentsline {chapter}{\numberline {6}How to...}{9}{chapter.6}\protected@file@percent }
\@writefile{lof}{\addvspace {10\p@ }}
\@writefile{lot}{\addvspace {10\p@ }}
\newlabel{ch:howto}{{6}{9}{How to..}{chapter.6}{}}
\@writefile{toc}{\contentsline {section}{\numberline {6.1}...create a custom DataFileHandler...}{9}{section.6.1}\protected@file@percent }
\newlabel{sec:customdatafilehandler}{{6.1}{9}{...create a custom DataFileHandler..}{section.6.1}{}}
\@writefile{lof}{\contentsline {figure}{\numberline {6.1}{\ignorespaces file handler class diagram\relax }}{9}{figure.caption.42}\protected@file@percent }
\newlabel{fig:filehandlerclassdiagram}{{6.1}{9}{file handler class diagram\relax }{figure.caption.42}{}}
\@writefile{toc}{\contentsline {subsection}{\numberline {6.1.1}...from AbstractDataFileHandler}{9}{subsection.6.1.1}\protected@file@percent }
\newlabel{sub:fromabstractdatafilehandler}{{6.1.1}{9}{...from AbstractDataFileHandler}{subsection.6.1.1}{}}
\@writefile{toc}{\contentsline {subsubsection}{\numberline {6.1.1.1}Usage of the ElementDataExchangeClass}{10}{subsubsection.6.1.1.1}\protected@file@percent }
\@writefile{lof}{\contentsline {figure}{\numberline {6.2}{\ignorespaces element exchange class diagram\relax }}{10}{figure.caption.43}\protected@file@percent }
\newlabel{fig:element-exchange}{{6.2}{10}{element exchange class diagram\relax }{figure.caption.43}{}}
\@writefile{lot}{\contentsline {table}{\numberline {6.1}{\ignorespaces ElementDataExchangeClass entries part I\relax }}{11}{table.caption.44}\protected@file@percent }
\@writefile{lot}{\contentsline {table}{\numberline {6.2}{\ignorespaces ElementDataExchangeClass entries part II\relax }}{11}{table.caption.45}\protected@file@percent }
\@writefile{lof}{\contentsline {figure}{\numberline {6.3}{\ignorespaces example property in Material Database\relax }}{12}{figure.caption.46}\protected@file@percent }
\newlabel{fig:element-exchange-example}{{6.3}{12}{example property in Material Database\relax }{figure.caption.46}{}}
\@writefile{lot}{\contentsline {table}{\numberline {6.3}{\ignorespaces property element as \text  {DataElementExchangeClass}\relax }}{12}{table.caption.47}\protected@file@percent }
\@writefile{toc}{\contentsline {subsection}{\numberline {6.1.2}...from AbstractXmlDataFileHandler}{12}{subsection.6.1.2}\protected@file@percent }
\@writefile{toc}{\contentsline {section}{\numberline {6.2}...add a new child-class of Dc43PredefinedMaterial}{13}{section.6.2}\protected@file@percent }
\@writefile{lof}{\contentsline {figure}{\numberline {6.4}{\ignorespaces added class with attributes\relax }}{14}{figure.caption.48}\protected@file@percent }
\newlabel{fig:hotoaddclass1}{{6.4}{14}{added class with attributes\relax }{figure.caption.48}{}}
\@writefile{toc}{\contentsline {section}{\numberline {6.3}...add a new DataFile...}{14}{section.6.3}\protected@file@percent }
\@writefile{toc}{\contentsline {subsection}{\numberline {6.3.1}...to an existing DataFile handler}{14}{subsection.6.3.1}\protected@file@percent }
\newlabel{sec:addtoexistingdatafile}{{6.3.1}{14}{...to an existing DataFile handler}{subsection.6.3.1}{}}
\@writefile{toc}{\contentsline {subsection}{\numberline {6.3.2}...with a new DataFile handler}{15}{subsection.6.3.2}\protected@file@percent }
\newlabel{sec:withnewdatafilehandler}{{6.3.2}{15}{...with a new DataFile handler}{subsection.6.3.2}{}}
\@writefile{toc}{\contentsline {subsection}{\numberline {6.3.3}...with a new child of AbstractXmlFileHandler}{15}{subsection.6.3.3}\protected@file@percent }
\newlabel{sec:abstracrxmlfileadd}{{6.3.3}{15}{...with a new child of AbstractXmlFileHandler}{subsection.6.3.3}{}}
\@writefile{toc}{\contentsline {section}{\numberline {6.4}...add a new action to the GUI}{16}{section.6.4}\protected@file@percent }
\newlabel{sec:actions}{{6.4}{16}{...add a new action to the GUI}{section.6.4}{}}
\@writefile{lof}{\contentsline {figure}{\numberline {6.5}{\ignorespaces add task code snipppet\relax }}{16}{figure.caption.49}\protected@file@percent }
\newlabel{fig:add-task}{{6.5}{16}{add task code snipppet\relax }{figure.caption.49}{}}
\@writefile{toc}{\contentsline {section}{\numberline {6.5}...change the model}{16}{section.6.5}\protected@file@percent }
\newlabel{sec:changemodel}{{6.5}{16}{...change the model}{section.6.5}{}}
\@writefile{toc}{\contentsline {section}{\numberline {6.6}...change the view}{17}{section.6.6}\protected@file@percent }
\@writefile{toc}{\contentsline {chapter}{\numberline {7}To do}{18}{chapter.7}\protected@file@percent }
\@writefile{lof}{\addvspace {10\p@ }}
\@writefile{lot}{\addvspace {10\p@ }}
\@writefile{toc}{\contentsline {section}{\numberline {7.1}add datafile-Button in GUI}{18}{section.7.1}\protected@file@percent }
\newlabel{sec:adddatafile}{{7.1}{18}{add datafile-Button in GUI}{section.7.1}{}}
\@writefile{toc}{\contentsline {subsection}{\numberline {7.1.1}Changes in the GUI}{18}{subsection.7.1.1}\protected@file@percent }
\@writefile{toc}{\contentsline {subsection}{\numberline {7.1.2}Changes in the Controller}{18}{subsection.7.1.2}\protected@file@percent }
\@writefile{toc}{\contentsline {section}{\numberline {7.2}removing DataFile}{19}{section.7.2}\protected@file@percent }
\@writefile{toc}{\contentsline {subsection}{\numberline {7.2.1}changes}{19}{subsection.7.2.1}\protected@file@percent }
\@writefile{toc}{\contentsline {subsection}{\numberline {7.2.2}moving elements}{20}{subsection.7.2.2}\protected@file@percent }
\@writefile{toc}{\contentsline {subsection}{\numberline {7.2.3}duplicate feature}{20}{subsection.7.2.3}\protected@file@percent }
\newlabel{subsub:duplicatefeature}{{7.2.3}{20}{duplicate feature}{subsection.7.2.3}{}}
\@writefile{toc}{\contentsline {subsubsection}{\numberline {7.2.3.1}changes in GUI}{20}{subsubsection.7.2.3.1}\protected@file@percent }
\@writefile{toc}{\contentsline {subsubsection}{\numberline {7.2.3.2}changes in Controller}{21}{subsubsection.7.2.3.2}\protected@file@percent }
\@writefile{toc}{\contentsline {subsubsection}{\numberline {7.2.3.3}changes in the Model}{21}{subsubsection.7.2.3.3}\protected@file@percent }
\@writefile{toc}{\contentsline {subsection}{\numberline {7.2.4}moving feature}{21}{subsection.7.2.4}\protected@file@percent }
\@writefile{toc}{\contentsline {subsubsection}{\numberline {7.2.4.1}change in GUI}{21}{subsubsection.7.2.4.1}\protected@file@percent }
\@writefile{toc}{\contentsline {subsubsection}{\numberline {7.2.4.2}changes in the Model}{21}{subsubsection.7.2.4.2}\protected@file@percent }
\@writefile{toc}{\contentsline {section}{\numberline {7.3}supporting "/"-sign in units}{22}{section.7.3}\protected@file@percent }
\@writefile{toc}{\contentsline {subsection}{\numberline {7.3.1}changes in the propertyElement}{22}{subsection.7.3.1}\protected@file@percent }
\@writefile{toc}{\contentsline {subsection}{\numberline {7.3.2}changes in the MatMlFileHandler}{22}{subsection.7.3.2}\protected@file@percent }
\@writefile{lof}{\contentsline {figure}{\numberline {7.1}{\ignorespaces unit in MatMl Style\relax }}{23}{figure.caption.50}\protected@file@percent }
\newlabel{fig:unitsave}{{7.1}{23}{unit in MatMl Style\relax }{figure.caption.50}{}}
\@writefile{toc}{\contentsline {section}{\numberline {7.4}Look up table support}{23}{section.7.4}\protected@file@percent }
\@writefile{toc}{\contentsline {subsection}{\numberline {7.4.1}changes in the Dc43 class diagram}{23}{subsection.7.4.1}\protected@file@percent }
\@writefile{toc}{\contentsline {chapter}{\numberline {8}Expansions}{24}{chapter.8}\protected@file@percent }
\@writefile{lof}{\addvspace {10\p@ }}
\@writefile{lot}{\addvspace {10\p@ }}
\@writefile{toc}{\contentsline {section}{\numberline {8.1}Search field for the GUI}{24}{section.8.1}\protected@file@percent }
\@writefile{lof}{\contentsline {figure}{\numberline {8.1}{\ignorespaces search field\relax }}{24}{figure.caption.51}\protected@file@percent }
\newlabel{fig:searchfield}{{8.1}{24}{search field\relax }{figure.caption.51}{}}
\@writefile{toc}{\contentsline {section}{\numberline {8.2}Search for property values in the GUI}{24}{section.8.2}\protected@file@percent }
\@setckpt{Programmers Guide}{
\setcounter{page}{26}
\setcounter{equation}{0}
\setcounter{enumi}{0}
\setcounter{enumii}{0}
\setcounter{enumiii}{0}
\setcounter{enumiv}{0}
\setcounter{footnote}{0}
\setcounter{mpfootnote}{0}
\setcounter{part}{2}
\setcounter{chapter}{8}
\setcounter{section}{2}
\setcounter{subsection}{0}
\setcounter{subsubsection}{0}
\setcounter{paragraph}{0}
\setcounter{subparagraph}{0}
\setcounter{figure}{1}
\setcounter{table}{0}
\setcounter{Item}{0}
\setcounter{Hfootnote}{0}
\setcounter{bookmark@seq@number}{0}
\setcounter{FancyVerbLine}{17}
\setcounter{parentequation}{0}
\setcounter{caption@flags}{0}
\setcounter{continuedfloat}{0}
\setcounter{lofdepth}{1}
\setcounter{lotdepth}{1}
\setcounter{float@type}{4}
\setcounter{AM@survey}{0}
\setcounter{subfigure}{0}
\setcounter{subtable}{0}
\setcounter{r@tfl@t}{0}
\setcounter{LT@tables}{0}
\setcounter{LT@chunks}{0}
\setcounter{section@level}{1}
}
