\relax 
\providecommand\hyper@newdestlabel[2]{}
\providecommand*\new@tpo@label[2]{}
\providecommand\HyperFirstAtBeginDocument{\AtBeginDocument}
\HyperFirstAtBeginDocument{\ifx\hyper@anchor\@undefined
\global\let\oldcontentsline\contentsline
\gdef\contentsline#1#2#3#4{\oldcontentsline{#1}{#2}{#3}}
\global\let\oldnewlabel\newlabel
\gdef\newlabel#1#2{\newlabelxx{#1}#2}
\gdef\newlabelxx#1#2#3#4#5#6{\oldnewlabel{#1}{{#2}{#3}}}
\AtEndDocument{\ifx\hyper@anchor\@undefined
\let\contentsline\oldcontentsline
\let\newlabel\oldnewlabel
\fi}
\fi}
\global\let\hyper@last\relax 
\gdef\HyperFirstAtBeginDocument#1{#1}
\providecommand\HyField@AuxAddToFields[1]{}
\providecommand\HyField@AuxAddToCoFields[2]{}
\providecommand\BKM@entry[2]{}
\providecommand\babel@aux[2]{}
\@nameuse{bbl@beforestart}
\catcode `"\active 
\AC@reset@newl@bel
\babel@aux{english}{}
\@input{UserGuide.aux}
\BKM@entry{id=1,dest={706172742E31},srcline={6}}{55736572204775696465}
\BKM@entry{id=2,dest={636861707465722E31},srcline={8}}{4463343320496D706C656D656E746174696F6E}
\BKM@entry{id=3,dest={73656374696F6E2E312E31},srcline={10}}{436C617373204469616772616D}
\BKM@entry{id=4,dest={73756273656374696F6E2E312E312E31},srcline={18}}{446334334D6174657269616C}
\BKM@entry{id=5,dest={73756273656374696F6E2E312E312E32},srcline={37}}{44633433507265646566696E65644D6174657269616C}
\BKM@entry{id=6,dest={73756273656374696F6E2E312E312E33},srcline={45}}{44633433507265646566696E65644D6574616C2F44633433507265646566696E6564506C61737469632F2E2E2E}
\BKM@entry{id=7,dest={73756273656374696F6E2E312E312E34},srcline={90}}{446334334D6174657269616C50726F7065727479}
\BKM@entry{id=8,dest={73756273756273656374696F6E2E312E312E342E31},srcline={130}}{4578616D706C65}
\BKM@entry{id=9,dest={73656374696F6E2E312E32},srcline={149}}{557361676520696E2067726170686963616C2072756C6573}
\BKM@entry{id=10,dest={636861707465722E32},srcline={152}}{44633433205573616765204578616D706C6573}
\BKM@entry{id=11,dest={73656374696F6E2E322E31},srcline={153}}{446966666572656E74204D6174657269616C20436C6173736573}
\BKM@entry{id=12,dest={73756273656374696F6E2E322E312E31},srcline={156}}{617320446334334D6174657269616C}
\BKM@entry{id=13,dest={73756273656374696F6E2E322E312E32},srcline={167}}{61732044633433507265646566696E65644D6174657269616C}
\BKM@entry{id=14,dest={73756273656374696F6E2E322E312E33},srcline={176}}{617320446334334D6574616C}
\BKM@entry{id=15,dest={73756273656374696F6E2E322E312E34},srcline={185}}{61732044633433506C6173746963}
\BKM@entry{id=16,dest={73656374696F6E2E322E32},srcline={188}}{47726170686963616C2052756C65204578616D706C65}
\BKM@entry{id=17,dest={73656374696F6E2E322E33},srcline={239}}{416363657373696E6720746865204463343350726F706572747920636C6173732076616C756573}
\BKM@entry{id=18,dest={636861707465722E33},srcline={243}}{4D6174657269616C20446174616261736520475549}
\BKM@entry{id=19,dest={73656374696F6E2E332E31},srcline={266}}{4D6174657269616C2054726565}
\BKM@entry{id=20,dest={73756273656374696F6E2E332E312E31},srcline={268}}{456C656D656E7473}
\BKM@entry{id=21,dest={73756273656374696F6E2E332E312E32},srcline={280}}{526967687420636C69636B206D656E75}
\BKM@entry{id=22,dest={73656374696F6E2E332E32},srcline={300}}{47656E6572616C2056696577}
\BKM@entry{id=23,dest={73656374696F6E2E332E33},srcline={312}}{50726F706572746965732056696577}
\BKM@entry{id=24,dest={73756273656374696F6E2E332E332E31},srcline={314}}{50726F70657274792043617465676F7279205461622D426172}
\BKM@entry{id=25,dest={73756273656374696F6E2E332E332E32},srcline={340}}{416374696F6E73204D656E752D426172}
\BKM@entry{id=26,dest={636861707465722E34},srcline={355}}{475549204578616D706C65}
\BKM@entry{id=27,dest={73656374696F6E2E342E31},srcline={357}}{6372656174652061206E6577206D6174657269616C}
\@input{ProgrammersGuide.aux}
\BKM@entry{id=28,dest={706172742E32},srcline={6}}{50726F6772616D6D657273204775696465}
\BKM@entry{id=29,dest={636861707465722E35},srcline={8}}{47656E6572616C}
\BKM@entry{id=30,dest={73656374696F6E2E352E31},srcline={13}}{4D61696E20537472756374757265}
\BKM@entry{id=31,dest={73756273656374696F6E2E352E312E31},srcline={28}}{4D6F64656C}
\BKM@entry{id=32,dest={73756273756273656374696F6E2E352E312E312E31},srcline={65}}{53696D706C654D6F64656C}
\BKM@entry{id=33,dest={73756273656374696F6E2E352E312E32},srcline={76}}{4461746146696C65732F4461746146696C6548616E646C6572}
\BKM@entry{id=34,dest={73756273656374696F6E2E352E312E33},srcline={91}}{566965772F53696D706C6556696577}
\BKM@entry{id=35,dest={73756273656374696F6E2E352E312E34},srcline={101}}{436F6E74726F6C6C65722F53696D706C65436F6E74726F6C6C6572}
\BKM@entry{id=36,dest={73756273656374696F6E2E352E312E35},srcline={104}}{4463343320696D706C656D656E746174696F6E2F4D6174657269616C446174614261736553746172746572}
\BKM@entry{id=37,dest={636861707465722E36},srcline={126}}{486F7720746F2E2E2E}
\BKM@entry{id=38,dest={73656374696F6E2E362E31},srcline={128}}{2E2E2E637265617465206120637573746F6D204461746146696C6548616E646C65722E2E2E}
\BKM@entry{id=39,dest={73756273656374696F6E2E362E312E31},srcline={140}}{2E2E2E66726F6D2041627374726163744461746146696C6548616E646C6572}
\BKM@entry{id=40,dest={73756273756273656374696F6E2E362E312E312E31},srcline={150}}{5573616765206F662074686520456C656D656E744461746145786368616E6765436C617373}
\BKM@entry{id=41,dest={73756273656374696F6E2E362E312E32},srcline={251}}{2E2E2E66726F6D204162737472616374586D6C4461746146696C6548616E646C6572}
\BKM@entry{id=42,dest={73656374696F6E2E362E32},srcline={272}}{2E2E2E6164642061206E6577206368696C642D636C617373206F662044633433507265646566696E65644D6174657269616C}
\BKM@entry{id=43,dest={73656374696F6E2E362E33},srcline={284}}{2E2E2E6164642061206E6577204461746146696C652E2E2E}
\BKM@entry{id=44,dest={73756273656374696F6E2E362E332E31},srcline={288}}{2E2E2E746F20616E206578697374696E67204461746146696C652068616E646C6572}
\BKM@entry{id=45,dest={73756273656374696F6E2E362E332E32},srcline={296}}{2E2E2E776974682061206E6577204461746146696C652068616E646C6572}
\BKM@entry{id=46,dest={73756273656374696F6E2E362E332E33},srcline={318}}{2E2E2E776974682061206E6577206368696C64206F66204162737472616374586D6C46696C6548616E646C6572}
\BKM@entry{id=47,dest={73656374696F6E2E362E34},srcline={343}}{2E2E2E6164642061206E6577207461736B20746F2074686520475549}
\BKM@entry{id=48,dest={73656374696F6E2E362E35},srcline={355}}{2E2E2E6368616E676520746865206D6F64656C}
\BKM@entry{id=49,dest={73656374696F6E2E362E36},srcline={359}}{2E2E2E6368616E6765207468652076696577}
\BKM@entry{id=50,dest={636861707465722E37},srcline={362}}{546F20646F}
\BKM@entry{id=51,dest={73656374696F6E2E372E31},srcline={365}}{616464206461746166696C652D427574746F6E20696E20475549}
\BKM@entry{id=52,dest={73756273656374696F6E2E372E312E31},srcline={368}}{4368616E67657320696E2074686520475549}
\BKM@entry{id=53,dest={73756273656374696F6E2E372E312E32},srcline={370}}{4368616E67657320696E2074686520436F6E74726F6C6C6572}
\BKM@entry{id=54,dest={73656374696F6E2E372E32},srcline={374}}{72656D6F76696E67204461746146696C65}
\BKM@entry{id=55,dest={73756273656374696F6E2E372E322E31},srcline={378}}{6368616E676573}
\BKM@entry{id=56,dest={73756273656374696F6E2E372E322E32},srcline={396}}{6D6F76696E6720656C656D656E7473}
\BKM@entry{id=57,dest={73756273656374696F6E2E372E322E33},srcline={398}}{6475706C69636174652066656174757265}
\BKM@entry{id=58,dest={73756273756273656374696F6E2E372E322E332E31},srcline={400}}{6368616E67657320696E20475549}
\BKM@entry{id=59,dest={73756273756273656374696F6E2E372E322E332E32},srcline={403}}{6368616E67657320696E20436F6E74726F6C6C6572}
\BKM@entry{id=60,dest={73756273756273656374696F6E2E372E322E332E33},srcline={406}}{6368616E67657320696E20746865204D6F64656C}
\BKM@entry{id=61,dest={73756273656374696F6E2E372E322E34},srcline={409}}{6D6F76696E672066656174757265}
\BKM@entry{id=62,dest={73756273756273656374696F6E2E372E322E342E31},srcline={411}}{6368616E676520696E20475549}
\BKM@entry{id=63,dest={73756273756273656374696F6E2E372E322E342E32},srcline={414}}{6368616E67657320696E20746865204D6F64656C}
\BKM@entry{id=64,dest={73656374696F6E2E372E33},srcline={434}}{737570706F7274696E6720222F222D7369676E20696E20756E697473}
\BKM@entry{id=65,dest={73756273656374696F6E2E372E332E31},srcline={436}}{6368616E67657320696E207468652070726F7065727479456C656D656E74}
\BKM@entry{id=66,dest={73756273656374696F6E2E372E332E32},srcline={439}}{6368616E67657320696E20746865204D61744D6C46696C6548616E646C6572}
\BKM@entry{id=67,dest={73656374696F6E2E372E34},srcline={449}}{4C6F6F6B207570207461626C6520737570706F7274}
\BKM@entry{id=68,dest={73756273656374696F6E2E372E342E31},srcline={451}}{6368616E67657320696E20746865204463343320636C617373206469616772616D}
\BKM@entry{id=69,dest={636861707465722E38},srcline={463}}{457870616E73696F6E73}
\BKM@entry{id=70,dest={73656374696F6E2E382E31},srcline={464}}{536561726368206669656C6420666F722074686520475549}
\BKM@entry{id=71,dest={73656374696F6E2E382E32},srcline={475}}{53656172636820666F722070726F70657274792076616C75657320696E2074686520475549}
\BKM@entry{id=72,dest={617070656E6469782E41},srcline={1}}{417070656E646978}
\@writefile{toc}{\contentsline {chapter}{\numberline {A}Appendix}{26}{appendix.A}\protected@file@percent }
\@writefile{lof}{\addvspace {10\p@ }}
\@writefile{lot}{\addvspace {10\p@ }}
\newlabel{chap:Appendix}{{A}{26}{Appendix}{appendix.A}{}}
\@writefile{lof}{\contentsline {figure}{\numberline {A.1}{\ignorespaces Full class diagram\relax }}{26}{figure.caption.51}\protected@file@percent }
\newlabel{fig:full-class-diagram}{{A.1}{26}{Full class diagram\relax }{figure.caption.51}{}}
\global\csname @altsecnumformattrue\endcsname
\gdef \@abspage@last{56}
