{
	"info": {
		"_postman_id": "",
		"name": "Test api",
		"schema": ""
	},
	"item": [
		{
			"name": "Health Check",
			"item": [
				{
					"dashboard": {
                        "id": null,
                        "uid": null,
                        "title": "Production Overview",
                        "tags": [ "templated" ],
                        "timezone": "browser",
                        "schemaVersion": 16,
                        "version": 0,
                        "refresh": "25s"
                      },
                      "folderId": 0,
                      "message": "Made changes to xyz",
                      "overwrite": false
                }