{
  "dirty": false,
  "raw": "v0.5.1-307-g6ff0f32",
  "hash": "g6ff0f32",
  "distance": 307,
  "tag": "v0.5.1",
  "semver": {
    "raw": "v0.5.1",
    "major": 0,
    "minor": 5,
    "patch": 1,
    "prerelease": [],
    "build": [],
    "version": "0.5.1"
  },
  "suffix": "307-g6ff0f32",
  "semverString": "0.5.1+307.g6ff0f32"
}