%YAML 1.1
%TAG !u! tag:unity3d.com,2011:
--- !u!29 &1
OcclusionCullingSettings:
  m_ObjectHideFlags: 0
  serializedVersion: 2
  m_OcclusionBakeSettings:
    smallestOccluder: 5
    smallestHole: 0.25
    backfaceThreshold: 100
  m_SceneGUID: 00000000000000000000000000000000
  m_OcclusionCullingData: {fileID: 0}
--- !u!104 &2
RenderSettings:
  m_ObjectHideFlags: 0
  serializedVersion: 8
  m_Fog: 0
  m_FogColor: {r: 0.5, g: 0.5, b: 0.5, a: 1}
  m_FogMode: 3
  m_FogDensity: 0.01
  m_LinearFogStart: 0
  m_LinearFogEnd: 300
  m_AmbientSkyColor: {r: 0.212, g: 0.227, b: 0.259, a: 1}
  m_AmbientEquatorColor: {r: 0.114, g: 0.125, b: 0.133, a: 1}
  m_AmbientGroundColor: {r: 0.047, g: 0.043, b: 0.035, a: 1}
  m_AmbientIntensity: 1
  m_AmbientMode: 3
  m_SubtractiveShadowColor: {r: 0.42, g: 0.478, b: 0.627, a: 1}
  m_SkyboxMaterial: {fileID: 0}
  m_HaloStrength: 0.5
  m_FlareStrength: 1
  m_FlareFadeSpeed: 3
  m_HaloTexture: {fileID: 0}
  m_SpotCookie: {fileID: 10001, guid: 0000000000000000e000000000000000, type: 0}
  m_DefaultReflectionMode: 0
  m_DefaultReflectionResolution: 128
  m_ReflectionBounces: 1
  m_ReflectionIntensity: 1
  m_CustomReflection: {fileID: 0}
  m_Sun: {fileID: 0}
  m_IndirectSpecularColor: {r: 0, g: 0, b: 0, a: 1}
--- !u!157 &3
LightmapSettings:
  m_ObjectHideFlags: 0
  serializedVersion: 11
  m_GIWorkflowMode: 1
  m_GISettings:
    serializedVersion: 2
    m_BounceScale: 1
    m_IndirectOutputScale: 1
    m_AlbedoBoost: 1
    m_TemporalCoherenceThreshold: 1
    m_EnvironmentLightingMode: 0
    m_EnableBakedLightmaps: 0
    m_EnableRealtimeLightmaps: 0
  m_LightmapEditorSettings:
    serializedVersion: 9
    m_Resolution: 2
    m_BakeResolution: 40
    m_TextureWidth: 1024
    m_TextureHeight: 1024
    m_AO: 0
    m_AOMaxDistance: 1
    m_CompAOExponent: 1
    m_CompAOExponentDirect: 0
    m_Padding: 2
    m_LightmapParameters: {fileID: 0}
    m_LightmapsBakeMode: 1
    m_TextureCompression: 1
    m_FinalGather: 0
    m_FinalGatherFiltering: 1
    m_FinalGatherRayCount: 256
    m_ReflectionCompression: 2
    m_MixedBakeMode: 2
    m_BakeBackend: 0
    m_PVRSampling: 1
    m_PVRDirectSampleCount: 32
    m_PVRSampleCount: 500
    m_PVRBounces: 2
    m_PVRFilterTypeDirect: 0
    m_PVRFilterTypeIndirect: 0
    m_PVRFilterTypeAO: 0
    m_PVRFilteringMode: 1
    m_PVRCulling: 1
    m_PVRFilteringGaussRadiusDirect: 1
    m_PVRFilteringGaussRadiusIndirect: 5
    m_PVRFilteringGaussRadiusAO: 2
    m_PVRFilteringAtrousPositionSigmaDirect: 0.5
    m_PVRFilteringAtrousPositionSigmaIndirect: 2
    m_PVRFilteringAtrousPositionSigmaAO: 1
  m_LightingDataAsset: {fileID: 0}
  m_UseShadowmask: 1
--- !u!196 &4
NavMeshSettings:
  serializedVersion: 2
  m_ObjectHideFlags: 0
  m_BuildSettings:
    serializedVersion: 2
    agentTypeID: 0
    agentRadius: 0.5
    agentHeight: 2
    agentSlope: 45
    agentClimb: 0.4
    ledgeDropHeight: 0
    maxJumpAcrossDistance: 0
    minRegionArea: 2
    manualCellSize: 0
    cellSize: 0.16666667
    manualTileSize: 0
    tileSize: 256
    accuratePlacement: 0
    debug:
      m_Flags: 0
  m_NavMeshData: {fileID: 0}
--- !u!1001 &60310999
Prefab:
  m_ObjectHideFlags: 0
  serializedVersion: 2
  m_Modification:
    m_TransformParent: {fileID: 0}
    m_Modifications:
    - target: {fileID: 4517442905496724, guid: ac4fbc23d31c245668226f8be444c2a8, type: 2}
      propertyPath: m_LocalPosition.x
      value: 0
      objectReference: {fileID: 0}
    - target: {fileID: 4517442905496724, guid: ac4fbc23d31c245668226f8be444c2a8, type: 2}
      propertyPath: m_LocalPosition.y
      value: 0
      objectReference: {fileID: 0}
    - target: {fileID: 4517442905496724, guid: ac4fbc23d31c245668226f8be444c2a8, type: 2}
      propertyPath: m_LocalPosition.z
      value: 0
      objectReference: {fileID: 0}
    - target: {fileID: 4517442905496724, guid: ac4fbc23d31c245668226f8be444c2a8, type: 2}
      propertyPath: m_LocalRotation.x
      value: 0
      objectReference: {fileID: 0}
    - target: {fileID: 4517442905496724, guid: ac4fbc23d31c245668226f8be444c2a8, type: 2}
      propertyPath: m_LocalRotation.y
      value: 0
      objectReference: {fileID: 0}
    - target: {fileID: 4517442905496724, guid: ac4fbc23d31c245668226f8be444c2a8, type: 2}
      propertyPath: m_LocalRotation.z
      value: 0
      objectReference: {fileID: 0}
    - target: {fileID: 4517442905496724, guid: ac4fbc23d31c245668226f8be444c2a8, type: 2}
      propertyPath: m_LocalRotation.w
      value: 1
      objectReference: {fileID: 0}
    - target: {fileID: 4517442905496724, guid: ac4fbc23d31c245668226f8be444c2a8, type: 2}
      propertyPath: m_RootOrder
      value: 8
      objectReference: {fileID: 0}
    m_RemovedComponents: []
  m_ParentPrefab: {fileID: 100100000, guid: ac4fbc23d31c245668226f8be444c2a8, type: 2}
  m_IsPrefabParent: 0
--- !u!1001 &423949568
Prefab:
  m_ObjectHideFlags: 0
  serializedVersion: 2
  m_Modification:
    m_TransformParent: {fileID: 0}
    m_Modifications:
    - target: {fileID: 4550774800414582, guid: 696f9be411272416bb8076658364871a, type: 2}
      propertyPath: m_LocalPosition.x
      value: 1.5339721
      objectReference: {fileID: 0}
    - target: {fileID: 4550774800414582, guid: 696f9be411272416bb8076658364871a, type: 2}
      propertyPath: m_LocalPosition.y
      value: -2.0913463
      objectReference: {fileID: 0}
    - target: {fileID: 4550774800414582, guid: 696f9be411272416bb8076658364871a, type: 2}
      propertyPath: m_LocalPosition.z
      value: 0
      objectReference: {fileID: 0}
    - target: {fileID: 4550774800414582, guid: 696f9be411272416bb8076658364871a, type: 2}
      propertyPath: m_LocalRotation.x
      value: -0
      objectReference: {fileID: 0}
    - target: {fileID: 4550774800414582, guid: 696f9be411272416bb8076658364871a, type: 2}
      propertyPath: m_LocalRotation.y
      value: -0
      objectReference: {fileID: 0}
    - target: {fileID: 4550774800414582, guid: 696f9be411272416bb8076658364871a, type: 2}
      propertyPath: m_LocalRotation.z
      value: -0
      objectReference: {fileID: 0}
    - target: {fileID: 4550774800414582, guid: 696f9be411272416bb8076658364871a, type: 2}
      propertyPath: m_LocalRotation.w
      value: 1
      objectReference: {fileID: 0}
    - target: {fileID: 4550774800414582, guid: 696f9be411272416bb8076658364871a, type: 2}
      propertyPath: m_RootOrder
      value: 1
      objectReference: {fileID: 0}
    - target: {fileID: 1976389177526950, guid: 696f9be411272416bb8076658364871a, type: 2}
      propertyPath: m_Name
      value: Bar1 (2)
      objectReference: {fileID: 0}
    m_RemovedComponents: []
  m_ParentPrefab: {fileID: 100100000, guid: 696f9be411272416bb8076658364871a, type: 2}
  m_IsPrefabParent: 0
--- !u!1001 &779463675
Prefab:
  m_ObjectHideFlags: 0
  serializedVersion: 2
  m_Modification:
    m_TransformParent: {fileID: 0}
    m_Modifications:
    - target: {fileID: 4550774800414582, guid: b98df87c54c2347c6b93bf5c67e33279, type: 2}
      propertyPath: m_LocalPosition.x
      value: 2.7577357
      objectReference: {fileID: 0}
    - target: {fileID: 4550774800414582, guid: b98df87c54c2347c6b93bf5c67e33279, type: 2}
      propertyPath: m_LocalPosition.y
      value: 3.3518522
      objectReference: {fileID: 0}
    - target: {fileID: 4550774800414582, guid: b98df87c54c2347c6b93bf5c67e33279, type: 2}
      propertyPath: m_LocalPosition.z
      value: 0
      objectReference: {fileID: 0}
    - target: {fileID: 4550774800414582, guid: b98df87c54c2347c6b93bf5c67e33279, type: 2}
      propertyPath: m_LocalRotation.x
      value: -0
      objectReference: {fileID: 0}
    - target: {fileID: 4550774800414582, guid: b98df87c54c2347c6b93bf5c67e33279, type: 2}
      propertyPath: m_LocalRotation.y
      value: -0
      objectReference: {fileID: 0}
    - target: {fileID: 4550774800414582, guid: b98df87c54c2347c6b93bf5c67e33279, type: 2}
      propertyPath: m_LocalRotation.z
      value: -0
      objectReference: {fileID: 0}
    - target: {fileID: 4550774800414582, guid: b98df87c54c2347c6b93bf5c67e33279, type: 2}
      propertyPath: m_LocalRotation.w
      value: 1
      objectReference: {fileID: 0}
    - target: {fileID: 4550774800414582, guid: b98df87c54c2347c6b93bf5c67e33279, type: 2}
      propertyPath: m_RootOrder
      value: 5
      objectReference: {fileID: 0}
    m_RemovedComponents: []
  m_ParentPrefab: {fileID: 100100000, guid: b98df87c54c2347c6b93bf5c67e33279, type: 2}
  m_IsPrefabParent: 0
--- !u!1001 &823478358
Prefab:
  m_ObjectHideFlags: 0
  serializedVersion: 2
  m_Modification:
    m_TransformParent: {fileID: 0}
    m_Modifications:
    - target: {fileID: 4246567473900996, guid: d3e8a4f3825a04c86ad2055c0dc18a7c, type: 2}
      propertyPath: m_LocalPosition.x
      value: -3.2
      objectReference: {fileID: 0}
    - target: {fileID: 4246567473900996, guid: d3e8a4f3825a04c86ad2055c0dc18a7c, type: 2}
      propertyPath: m_LocalPosition.y
      value: -3.6720407
      objectReference: {fileID: 0}
    - target: {fileID: 4246567473900996, guid: d3e8a4f3825a04c86ad2055c0dc18a7c, type: 2}
      propertyPath: m_LocalPosition.z
      value: 0
      objectReference: {fileID: 0}
    - target: {fileID: 4246567473900996, guid: d3e8a4f3825a04c86ad2055c0dc18a7c, type: 2}
      propertyPath: m_LocalRotation.x
      value: 0
      objectReference: {fileID: 0}
    - target: {fileID: 4246567473900996, guid: d3e8a4f3825a04c86ad2055c0dc18a7c, type: 2}
      propertyPath: m_LocalRotation.y
      value: 0
      objectReference: {fileID: 0}
    - target: {fileID: 4246567473900996, guid: d3e8a4f3825a04c86ad2055c0dc18a7c, type: 2}
      propertyPath: m_LocalRotation.z
      value: 0
      objectReference: {fileID: 0}
    - target: {fileID: 4246567473900996, guid: d3e8a4f3825a04c86ad2055c0dc18a7c, type: 2}
      propertyPath: m_LocalRotation.w
      value: 1
      objectReference: {fileID: 0}
    - target: {fileID: 4246567473900996, guid: d3e8a4f3825a04c86ad2055c0dc18a7c, type: 2}
      propertyPath: m_RootOrder
      value: 1
      objectReference: {fileID: 0}
    - target: {fileID: 1572039315562386, guid: d3e8a4f3825a04c86ad2055c0dc18a7c, type: 2}
      propertyPath: m_Name
      value: Goal (1)
      objectReference: {fileID: 0}
    m_RemovedComponents: []
  m_ParentPrefab: {fileID: 100100000, guid: d3e8a4f3825a04c86ad2055c0dc18a7c, type: 2}
  m_IsPrefabParent: 0
--- !u!1001 &851187593
Prefab:
  m_ObjectHideFlags: 0
  serializedVersion: 2
  m_Modification:
    m_TransformParent: {fileID: 0}
    m_Modifications:
    - target: {fileID: 4550774800414582, guid: 5a4f973b2269348208bd19d5f051972b, type: 2}
      propertyPath: m_LocalPosition.x
      value: -1.372466
      objectReference: {fileID: 0}
    - target: {fileID: 4550774800414582, guid: 5a4f973b2269348208bd19d5f051972b, type: 2}
      propertyPath: m_LocalPosition.y
      value: -0.6508744
      objectReference: {fileID: 0}
    - target: {fileID: 4550774800414582, guid: 5a4f973b2269348208bd19d5f051972b, type: 2}
      propertyPath: m_LocalPosition.z
      value: 0
      objectReference: {fileID: 0}
    - target: {fileID: 4550774800414582, guid: 5a4f973b2269348208bd19d5f051972b, type: 2}
      propertyPath: m_LocalRotation.x
      value: -0
      objectReference: {fileID: 0}
    - target: {fileID: 4550774800414582, guid: 5a4f973b2269348208bd19d5f051972b, type: 2}
      propertyPath: m_LocalRotation.y
      value: -0
      objectReference: {fileID: 0}
    - target: {fileID: 4550774800414582, guid: 5a4f973b2269348208bd19d5f051972b, type: 2}
      propertyPath: m_LocalRotation.z
      value: -0
      objectReference: {fileID: 0}
    - target: {fileID: 4550774800414582, guid: 5a4f973b2269348208bd19d5f051972b, type: 2}
      propertyPath: m_LocalRotation.w
      value: 1
      objectReference: {fileID: 0}
    - target: {fileID: 4550774800414582, guid: 5a4f973b2269348208bd19d5f051972b, type: 2}
      propertyPath: m_RootOrder
      value: 2
      objectReference: {fileID: 0}
    - target: {fileID: 1976389177526950, guid: 5a4f973b2269348208bd19d5f051972b, type: 2}
      propertyPath: m_Name
      value: Corner2 (1)
      objectReference: {fileID: 0}
    m_RemovedComponents: []
  m_ParentPrefab: {fileID: 100100000, guid: 5a4f973b2269348208bd19d5f051972b, type: 2}
  m_IsPrefabParent: 0
--- !u!1001 &988650937
Prefab:
  m_ObjectHideFlags: 0
  serializedVersion: 2
  m_Modification:
    m_TransformParent: {fileID: 0}
    m_Modifications:
    - target: {fileID: 4550774800414582, guid: b98df87c54c2347c6b93bf5c67e33279, type: 2}
      propertyPath: m_LocalPosition.x
      value: -1.397961
      objectReference: {fileID: 0}
    - target: {fileID: 4550774800414582, guid: b98df87c54c2347c6b93bf5c67e33279, type: 2}
      propertyPath: m_LocalPosition.y
      value: -2.5885
      objectReference: {fileID: 0}
    - target: {fileID: 4550774800414582, guid: b98df87c54c2347c6b93bf5c67e33279, type: 2}
      propertyPath: m_LocalPosition.z
      value: 0
      objectReference: {fileID: 0}
    - target: {fileID: 4550774800414582, guid: b98df87c54c2347c6b93bf5c67e33279, type: 2}
      propertyPath: m_LocalRotation.x
      value: -0
      objectReference: {fileID: 0}
    - target: {fileID: 4550774800414582, guid: b98df87c54c2347c6b93bf5c67e33279, type: 2}
      propertyPath: m_LocalRotation.y
      value: -0
      objectReference: {fileID: 0}
    - target: {fileID: 4550774800414582, guid: b98df87c54c2347c6b93bf5c67e33279, type: 2}
      propertyPath: m_LocalRotation.z
      value: -0
      objectReference: {fileID: 0}
    - target: {fileID: 4550774800414582, guid: b98df87c54c2347c6b93bf5c67e33279, type: 2}
      propertyPath: m_LocalRotation.w
      value: 1
      objectReference: {fileID: 0}
    - target: {fileID: 4550774800414582, guid: b98df87c54c2347c6b93bf5c67e33279, type: 2}
      propertyPath: m_RootOrder
      value: 3
      objectReference: {fileID: 0}
    - target: {fileID: 1976389177526950, guid: b98df87c54c2347c6b93bf5c67e33279, type: 2}
      propertyPath: m_Name
      value: Bar1 (1)
      objectReference: {fileID: 0}
    m_RemovedComponents: []
  m_ParentPrefab: {fileID: 100100000, guid: b98df87c54c2347c6b93bf5c67e33279, type: 2}
  m_IsPrefabParent: 0
--- !u!1001 &1220021289
Prefab:
  m_ObjectHideFlags: 0
  serializedVersion: 2
  m_Modification:
    m_TransformParent: {fileID: 0}
    m_Modifications:
    - target: {fileID: 4550774800414582, guid: e1e29d792e7184143a25a4a201657fa5, type: 2}
      propertyPath: m_LocalPosition.x
      value: -0.033974707
      objectReference: {fileID: 0}
    - target: {fileID: 4550774800414582, guid: e1e29d792e7184143a25a4a201657fa5, type: 2}
      propertyPath: m_LocalPosition.y
      value: 0.08848262
      objectReference: {fileID: 0}
    - target: {fileID: 4550774800414582, guid: e1e29d792e7184143a25a4a201657fa5, type: 2}
      propertyPath: m_LocalPosition.z
      value: 0
      objectReference: {fileID: 0}
    - target: {fileID: 4550774800414582, guid: e1e29d792e7184143a25a4a201657fa5, type: 2}
      propertyPath: m_LocalRotation.x
      value: -0
      objectReference: {fileID: 0}
    - target: {fileID: 4550774800414582, guid: e1e29d792e7184143a25a4a201657fa5, type: 2}
      propertyPath: m_LocalRotation.y
      value: -0
      objectReference: {fileID: 0}
    - target: {fileID: 4550774800414582, guid: e1e29d792e7184143a25a4a201657fa5, type: 2}
      propertyPath: m_LocalRotation.z
      value: -0
      objectReference: {fileID: 0}
    - target: {fileID: 4550774800414582, guid: e1e29d792e7184143a25a4a201657fa5, type: 2}
      propertyPath: m_LocalRotation.w
      value: 1
      objectReference: {fileID: 0}
    - target: {fileID: 4550774800414582, guid: e1e29d792e7184143a25a4a201657fa5, type: 2}
      propertyPath: m_RootOrder
      value: 6
      objectReference: {fileID: 0}
    m_RemovedComponents: []
  m_ParentPrefab: {fileID: 100100000, guid: e1e29d792e7184143a25a4a201657fa5, type: 2}
  m_IsPrefabParent: 0
--- !u!1001 &1237805430
Prefab:
  m_ObjectHideFlags: 0
  serializedVersion: 2
  m_Modification:
    m_TransformParent: {fileID: 0}
    m_Modifications:
    - target: {fileID: 4246567473900996, guid: d3e8a4f3825a04c86ad2055c0dc18a7c, type: 2}
      propertyPath: m_LocalPosition.x
      value: 2.93
      objectReference: {fileID: 0}
    - target: {fileID: 4246567473900996, guid: d3e8a4f3825a04c86ad2055c0dc18a7c, type: 2}
      propertyPath: m_LocalPosition.y
      value: -3.6
      objectReference: {fileID: 0}
    - target: {fileID: 4246567473900996, guid: d3e8a4f3825a04c86ad2055c0dc18a7c, type: 2}
      propertyPath: m_LocalPosition.z
      value: 0
      objectReference: {fileID: 0}
    - target: {fileID: 4246567473900996, guid: d3e8a4f3825a04c86ad2055c0dc18a7c, type: 2}
      propertyPath: m_LocalRotation.x
      value: 0
      objectReference: {fileID: 0}
    - target: {fileID: 4246567473900996, guid: d3e8a4f3825a04c86ad2055c0dc18a7c, type: 2}
      propertyPath: m_LocalRotation.y
      value: 0
      objectReference: {fileID: 0}
    - target: {fileID: 4246567473900996, guid: d3e8a4f3825a04c86ad2055c0dc18a7c, type: 2}
      propertyPath: m_LocalRotation.z
      value: 0
      objectReference: {fileID: 0}
    - target: {fileID: 4246567473900996, guid: d3e8a4f3825a04c86ad2055c0dc18a7c, type: 2}
      propertyPath: m_LocalRotation.w
      value: 1
      objectReference: {fileID: 0}
    - target: {fileID: 4246567473900996, guid: d3e8a4f3825a04c86ad2055c0dc18a7c, type: 2}
      propertyPath: m_RootOrder
      value: 0
      objectReference: {fileID: 0}
    m_RemovedComponents: []
  m_ParentPrefab: {fileID: 100100000, guid: d3e8a4f3825a04c86ad2055c0dc18a7c, type: 2}
  m_IsPrefabParent: 0
--- !u!1001 &1317340608
Prefab:
  m_ObjectHideFlags: 0
  serializedVersion: 2
  m_Modification:
    m_TransformParent: {fileID: 0}
    m_Modifications:
    - target: {fileID: 4523756964791732, guid: d184700e8104e47ee95bf0f5f88a760e, type: 2}
      propertyPath: m_LocalPosition.x
      value: 0
      objectReference: {fileID: 0}
    - target: {fileID: 4523756964791732, guid: d184700e8104e47ee95bf0f5f88a760e, type: 2}
      propertyPath: m_LocalPosition.y
      value: 0.1
      objectReference: {fileID: 0}
    - target: {fileID: 4523756964791732, guid: d184700e8104e47ee95bf0f5f88a760e, type: 2}
      propertyPath: m_LocalPosition.z
      value: 0
      objectReference: {fileID: 0}
    - target: {fileID: 4523756964791732, guid: d184700e8104e47ee95bf0f5f88a760e, type: 2}
      propertyPath: m_LocalRotation.x
      value: 0
      objectReference: {fileID: 0}
    - target: {fileID: 4523756964791732, guid: d184700e8104e47ee95bf0f5f88a760e, type: 2}
      propertyPath: m_LocalRotation.y
      value: 0
      objectReference: {fileID: 0}
    - target: {fileID: 4523756964791732, guid: d184700e8104e47ee95bf0f5f88a760e, type: 2}
      propertyPath: m_LocalRotation.z
      value: 0
      objectReference: {fileID: 0}
    - target: {fileID: 4523756964791732, guid: d184700e8104e47ee95bf0f5f88a760e, type: 2}
      propertyPath: m_LocalRotation.w
      value: 1
      objectReference: {fileID: 0}
    - target: {fileID: 4523756964791732, guid: d184700e8104e47ee95bf0f5f88a760e, type: 2}
      propertyPath: m_RootOrder
      value: 9
      objectReference: {fileID: 0}
    m_RemovedComponents: []
  m_ParentPrefab: {fileID: 100100000, guid: d184700e8104e47ee95bf0f5f88a760e, type: 2}
  m_IsPrefabParent: 0
--- !u!1001 &1694898073
Prefab:
  m_ObjectHideFlags: 0
  serializedVersion: 2
  m_Modification:
    m_TransformParent: {fileID: 0}
    m_Modifications:
    - target: {fileID: 4550774800414582, guid: 5a4f973b2269348208bd19d5f051972b, type: 2}
      propertyPath: m_LocalPosition.x
      value: 2.7959788
      objectReference: {fileID: 0}
    - target: {fileID: 4550774800414582, guid: 5a4f973b2269348208bd19d5f051972b, type: 2}
      propertyPath: m_LocalPosition.y
      value: 2.6
      objectReference: {fileID: 0}
    - target: {fileID: 4550774800414582, guid: 5a4f973b2269348208bd19d5f051972b, type: 2}
      propertyPath: m_LocalPosition.z
      value: 0
      objectReference: {fileID: 0}
    - target: {fileID: 4550774800414582, guid: 5a4f973b2269348208bd19d5f051972b, type: 2}
      propertyPath: m_LocalRotation.x
      value: -0
      objectReference: {fileID: 0}
    - target: {fileID: 4550774800414582, guid: 5a4f973b2269348208bd19d5f051972b, type: 2}
      propertyPath: m_LocalRotation.y
      value: -0
      objectReference: {fileID: 0}
    - target: {fileID: 4550774800414582, guid: 5a4f973b2269348208bd19d5f051972b, type: 2}
      propertyPath: m_LocalRotation.z
      value: -0
      objectReference: {fileID: 0}
    - target: {fileID: 4550774800414582, guid: 5a4f973b2269348208bd19d5f051972b, type: 2}
      propertyPath: m_LocalRotation.w
      value: 1
      objectReference: {fileID: 0}
    - target: {fileID: 4550774800414582, guid: 5a4f973b2269348208bd19d5f051972b, type: 2}
      propertyPath: m_RootOrder
      value: 7
      objectReference: {fileID: 0}
    - target: {fileID: 4294799766821806, guid: 5a4f973b2269348208bd19d5f051972b, type: 2}
      propertyPath: m_LocalPosition.y
      value: 0
      objectReference: {fileID: 0}
    m_RemovedComponents: []
  m_ParentPrefab: {fileID: 100100000, guid: 5a4f973b2269348208bd19d5f051972b, type: 2}
  m_IsPrefabParent: 0
--- !u!1001 &1862460703
Prefab:
  m_ObjectHideFlags: 0
  serializedVersion: 2
  m_Modification:
    m_TransformParent: {fileID: 0}
    m_Modifications:
    - target: {fileID: 4523756964791732, guid: 37e83382f5b664fd399976d3732c9b14, type: 2}
      propertyPath: m_LocalPosition.x
      value: 2.7577357
      objectReference: {fileID: 0}
    - target: {fileID: 4523756964791732, guid: 37e83382f5b664fd399976d3732c9b14, type: 2}
      propertyPath: m_LocalPosition.y
      value: 3.3646
      objectReference: {fileID: 0}
    - target: {fileID: 4523756964791732, guid: 37e83382f5b664fd399976d3732c9b14, type: 2}
      propertyPath: m_LocalPosition.z
      value: 0
      objectReference: {fileID: 0}
    - target: {fileID: 4523756964791732, guid: 37e83382f5b664fd399976d3732c9b14, type: 2}
      propertyPath: m_LocalRotation.x
      value: 0
      objectReference: {fileID: 0}
    - target: {fileID: 4523756964791732, guid: 37e83382f5b664fd399976d3732c9b14, type: 2}
      propertyPath: m_LocalRotation.y
      value: 0
      objectReference: {fileID: 0}
    - target: {fileID: 4523756964791732, guid: 37e83382f5b664fd399976d3732c9b14, type: 2}
      propertyPath: m_LocalRotation.z
      value: 0
      objectReference: {fileID: 0}
    - target: {fileID: 4523756964791732, guid: 37e83382f5b664fd399976d3732c9b14, type: 2}
      propertyPath: m_LocalRotation.w
      value: 1
      objectReference: {fileID: 0}
    - target: {fileID: 4523756964791732, guid: 37e83382f5b664fd399976d3732c9b14, type: 2}
      propertyPath: m_RootOrder
      value: 4
      objectReference: {fileID: 0}
    m_RemovedComponents: []
  m_ParentPrefab: {fileID: 100100000, guid: 37e83382f5b664fd399976d3732c9b14, type: 2}
  m_IsPrefabParent: 0
