%YAML 1.1
%TAG !u! tag:unity3d.com,2011:
--- !u!1045 &1
EditorBuildSettings:
  m_ObjectHideFlags: 0
  serializedVersion: 2
  m_Scenes:
  - enabled: 1
    path: Assets/_Scenes/SharedData.unity
    guid: 158a7eca177b945dbad1ee1a995b19b1
  - enabled: 1
    path: Assets/_Scenes/DEV-Start.unity
    guid: a9879069f3f494dc3a82f79448050151
  - enabled: 1
    path: Assets/_Scenes/Client.unity
    guid: 2de3405f605387e4c8ec738b7f426a83
  - enabled: 1
    path: Assets/_Scenes/Server.unity
    guid: bbc9b300712ce46deb046a9f3873027b
  - enabled: 1
    path: Assets/_Scenes/Server-WithOverview.unity
    guid: 152a445cec94843d790fa44112297685
  m_configObjects: {}
