%YAML 1.1
%TAG !u! tag:unity3d.com,2011:
--- !u!74 &7400000
AnimationClip:
  m_ObjectHideFlags: 0
  m_CorrespondingSourceObject: {fileID: 0}
  m_PrefabInstance: {fileID: 0}
  m_PrefabAsset: {fileID: 0}
  m_Name: RefreshButtonAnimation
  serializedVersion: 6
  m_Legacy: 0
  m_Compressed: 0
  m_UseHighQualityCurve: 1
  m_RotationCurves: []
  m_CompressedRotationCurves: []
  m_EulerCurves: []
  m_PositionCurves: []
  m_ScaleCurves: []
  m_FloatCurves: []
  m_PPtrCurves:
  - curve:
    - time: 0
      value: {fileID: 21300000, guid: f2c2953686ddd4175855adee5567a210, type: 3}
    - time: 0.016666668
      value: {fileID: 21300000, guid: c6b1543e620834d18920905c1fb234fe, type: 3}
    - time: 0.033333335
      value: {fileID: 21300000, guid: 432f39296db55497ea1cb40eb07e030d, type: 3}
    - time: 0.05
      value: {fileID: 21300000, guid: 38b73a1b65cc94c23b4401781846c57e, type: 3}
    - time: 0.06666667
      value: {fileID: 21300000, guid: b549fb797388849b9b89ca453bc7c841, type: 3}
    - time: 0.083333336
      value: {fileID: 21300000, guid: 370c24ab13cca493baf358b425aa5bab, type: 3}
    - time: 0.1
      value: {fileID: 21300000, guid: bb67016a5824f47999b1be0e4da1aefc, type: 3}
    - time: 0.11666667
      value: {fileID: 21300000, guid: 48508a13cea374769af55eb2a049b908, type: 3}
    - time: 0.13333334
      value: {fileID: 21300000, guid: 9d3411b9ff9bb4c2692dbfa5752e5bfa, type: 3}
    - time: 0.15
      value: {fileID: 21300000, guid: c05bc34e459eb45b9a1476ec4c21c51e, type: 3}
    - time: 0.16666667
      value: {fileID: 21300000, guid: 2ccf4a62a41cf4c15b6eb1cca99389f9, type: 3}
    - time: 0.18333334
      value: {fileID: 21300000, guid: a7946b77be2f540c4ad6296835991609, type: 3}
    - time: 0.2
      value: {fileID: 21300000, guid: d907f43c41e274076b45d2e0644fda98, type: 3}
    - time: 0.21666667
      value: {fileID: 21300000, guid: 511417b49f8b2495fb7d75effe13c1c1, type: 3}
    - time: 0.23333333
      value: {fileID: 21300000, guid: 8719b3c2884504667bea29a6d43cd380, type: 3}
    - time: 0.25
      value: {fileID: 21300000, guid: f1f100eb32bff45d9aa6f71c57fbaf31, type: 3}
    - time: 0.26666668
      value: {fileID: 21300000, guid: 267ab5b3096494556ba60d5db5d8c49e, type: 3}
    - time: 0.28333333
      value: {fileID: 21300000, guid: e52c5e213b5584639859994beb6c1296, type: 3}
    - time: 0.3
      value: {fileID: 21300000, guid: 58032f16895e04f4ab03d910c435b340, type: 3}
    - time: 0.31666666
      value: {fileID: 21300000, guid: b8ddb61d8077c4142a4b78258ee1b45f, type: 3}
    - time: 0.33333334
      value: {fileID: 21300000, guid: 46b75dc8d63334fdfbd2d24c29914ed1, type: 3}
    - time: 0.35
      value: {fileID: 21300000, guid: 13eac5adb03c74cc6a5cc9cabfcd8cb7, type: 3}
    - time: 0.36666667
      value: {fileID: 21300000, guid: 3d20a4a14c11b40a99f3f20acab162a0, type: 3}
    - time: 0.38333333
      value: {fileID: 21300000, guid: b9e018786b7cf4035b03c4f3df0fa126, type: 3}
    - time: 0.4
      value: {fileID: 21300000, guid: b7380a9d1f93d4d778fa18dc48bf8a70, type: 3}
    - time: 0.41666666
      value: {fileID: 21300000, guid: 9b13777fc3b514c62a1ac970fd699f9e, type: 3}
    - time: 0.43333334
      value: {fileID: 21300000, guid: 278f396532ed24c92b04539713d8a7e8, type: 3}
    - time: 0.45
      value: {fileID: 21300000, guid: 96a175e389d8c4659ba633157cae2365, type: 3}
    - time: 0.46666667
      value: {fileID: 21300000, guid: 38ed92178ad5041058d722a8f4d8b373, type: 3}
    - time: 0.48333332
      value: {fileID: 21300000, guid: f2a7a760a8c5d459fbc2d98dcfbf946d, type: 3}
    - time: 0.5
      value: {fileID: 21300000, guid: 0e1931a94864c47be9093e9057bd2783, type: 3}
    - time: 0.51666665
      value: {fileID: 21300000, guid: 76813d091c8da4949bb3d680e3cea765, type: 3}
    - time: 0.53333336
      value: {fileID: 21300000, guid: 10cbd5e329ef94e32ad620097c8bd2cb, type: 3}
    - time: 0.55
      value: {fileID: 21300000, guid: ab36838f2b9604c5aa9afd29a7e234a6, type: 3}
    - time: 0.56666666
      value: {fileID: 21300000, guid: 7cb94e0dfdf5146e8aa20553e330f987, type: 3}
    - time: 0.5833333
      value: {fileID: 21300000, guid: c23fcdb5b8af24588a408d6d5533ec7b, type: 3}
    - time: 0.6
      value: {fileID: 21300000, guid: f4f33d3576ea24cdf8d4180f43117bb3, type: 3}
    - time: 0.6166667
      value: {fileID: 21300000, guid: 25f5f1de955f44b5183e8618f62c570d, type: 3}
    - time: 0.6333333
      value: {fileID: 21300000, guid: 34aa7ed156f1646adbd510fc55584f53, type: 3}
    - time: 0.65
      value: {fileID: 21300000, guid: 53e2912b9229d453b9b0eb761752fbe0, type: 3}
    - time: 0.6666667
      value: {fileID: 21300000, guid: 4930f397a1947466894f36399b1dcb63, type: 3}
    - time: 0.68333334
      value: {fileID: 21300000, guid: c8de07e9c04e544039d65c8261de48c7, type: 3}
    - time: 0.7
      value: {fileID: 21300000, guid: e7a760a4f96bb4ce8a0b7d694b27ceb3, type: 3}
    - time: 0.71666664
      value: {fileID: 21300000, guid: 5441d61c96e8f41ebbdee68bd555e412, type: 3}
    - time: 0.73333335
      value: {fileID: 21300000, guid: bb6d3a5596a4a4d0088e43d33e55203b, type: 3}
    - time: 0.75
      value: {fileID: 21300000, guid: fe49f958ae8384af89d3cc43739fcaba, type: 3}
    - time: 0.76666665
      value: {fileID: 21300000, guid: dcb07a6eaa0ed4010bcda985bdd60331, type: 3}
    - time: 0.78333336
      value: {fileID: 21300000, guid: 5a0a6ee1e84ba4634b38ecc484f62b3f, type: 3}
    - time: 0.8
      value: {fileID: 21300000, guid: 787254d97a69248edabb81778f8517ba, type: 3}
    - time: 0.81666666
      value: {fileID: 21300000, guid: 0a3b2377869ca4743a4a42c7b3c6e5c9, type: 3}
    - time: 0.8333333
      value: {fileID: 21300000, guid: 89aef04d6a29b44c691507b3da018be4, type: 3}
    attribute: m_Sprite
    path: 
    classID: 114
    script: {fileID: 11500000, guid: fe87c0e1cc204ed48ad3b37840f39efc, type: 3}
  m_SampleRate: 60
  m_WrapMode: 0
  m_Bounds:
    m_Center: {x: 0, y: 0, z: 0}
    m_Extent: {x: 0, y: 0, z: 0}
  m_ClipBindingConstant:
    genericBindings:
    - serializedVersion: 2
      path: 0
      attribute: 2015549526
      script: {fileID: 11500000, guid: fe87c0e1cc204ed48ad3b37840f39efc, type: 3}
      typeID: 114
      customType: 0
      isPPtrCurve: 1
    pptrCurveMapping:
    - {fileID: 21300000, guid: f2c2953686ddd4175855adee5567a210, type: 3}
    - {fileID: 21300000, guid: c6b1543e620834d18920905c1fb234fe, type: 3}
    - {fileID: 21300000, guid: 432f39296db55497ea1cb40eb07e030d, type: 3}
    - {fileID: 21300000, guid: 38b73a1b65cc94c23b4401781846c57e, type: 3}
    - {fileID: 21300000, guid: b549fb797388849b9b89ca453bc7c841, type: 3}
    - {fileID: 21300000, guid: 370c24ab13cca493baf358b425aa5bab, type: 3}
    - {fileID: 21300000, guid: bb67016a5824f47999b1be0e4da1aefc, type: 3}
    - {fileID: 21300000, guid: 48508a13cea374769af55eb2a049b908, type: 3}
    - {fileID: 21300000, guid: 9d3411b9ff9bb4c2692dbfa5752e5bfa, type: 3}
    - {fileID: 21300000, guid: c05bc34e459eb45b9a1476ec4c21c51e, type: 3}
    - {fileID: 21300000, guid: 2ccf4a62a41cf4c15b6eb1cca99389f9, type: 3}
    - {fileID: 21300000, guid: a7946b77be2f540c4ad6296835991609, type: 3}
    - {fileID: 21300000, guid: d907f43c41e274076b45d2e0644fda98, type: 3}
    - {fileID: 21300000, guid: 511417b49f8b2495fb7d75effe13c1c1, type: 3}
    - {fileID: 21300000, guid: 8719b3c2884504667bea29a6d43cd380, type: 3}
    - {fileID: 21300000, guid: f1f100eb32bff45d9aa6f71c57fbaf31, type: 3}
    - {fileID: 21300000, guid: 267ab5b3096494556ba60d5db5d8c49e, type: 3}
    - {fileID: 21300000, guid: e52c5e213b5584639859994beb6c1296, type: 3}
    - {fileID: 21300000, guid: 58032f16895e04f4ab03d910c435b340, type: 3}
    - {fileID: 21300000, guid: b8ddb61d8077c4142a4b78258ee1b45f, type: 3}
    - {fileID: 21300000, guid: 46b75dc8d63334fdfbd2d24c29914ed1, type: 3}
    - {fileID: 21300000, guid: 13eac5adb03c74cc6a5cc9cabfcd8cb7, type: 3}
    - {fileID: 21300000, guid: 3d20a4a14c11b40a99f3f20acab162a0, type: 3}
    - {fileID: 21300000, guid: b9e018786b7cf4035b03c4f3df0fa126, type: 3}
    - {fileID: 21300000, guid: b7380a9d1f93d4d778fa18dc48bf8a70, type: 3}
    - {fileID: 21300000, guid: 9b13777fc3b514c62a1ac970fd699f9e, type: 3}
    - {fileID: 21300000, guid: 278f396532ed24c92b04539713d8a7e8, type: 3}
    - {fileID: 21300000, guid: 96a175e389d8c4659ba633157cae2365, type: 3}
    - {fileID: 21300000, guid: 38ed92178ad5041058d722a8f4d8b373, type: 3}
    - {fileID: 21300000, guid: f2a7a760a8c5d459fbc2d98dcfbf946d, type: 3}
    - {fileID: 21300000, guid: 0e1931a94864c47be9093e9057bd2783, type: 3}
    - {fileID: 21300000, guid: 76813d091c8da4949bb3d680e3cea765, type: 3}
    - {fileID: 21300000, guid: 10cbd5e329ef94e32ad620097c8bd2cb, type: 3}
    - {fileID: 21300000, guid: ab36838f2b9604c5aa9afd29a7e234a6, type: 3}
    - {fileID: 21300000, guid: 7cb94e0dfdf5146e8aa20553e330f987, type: 3}
    - {fileID: 21300000, guid: c23fcdb5b8af24588a408d6d5533ec7b, type: 3}
    - {fileID: 21300000, guid: f4f33d3576ea24cdf8d4180f43117bb3, type: 3}
    - {fileID: 21300000, guid: 25f5f1de955f44b5183e8618f62c570d, type: 3}
    - {fileID: 21300000, guid: 34aa7ed156f1646adbd510fc55584f53, type: 3}
    - {fileID: 21300000, guid: 53e2912b9229d453b9b0eb761752fbe0, type: 3}
    - {fileID: 21300000, guid: 4930f397a1947466894f36399b1dcb63, type: 3}
    - {fileID: 21300000, guid: c8de07e9c04e544039d65c8261de48c7, type: 3}
    - {fileID: 21300000, guid: e7a760a4f96bb4ce8a0b7d694b27ceb3, type: 3}
    - {fileID: 21300000, guid: 5441d61c96e8f41ebbdee68bd555e412, type: 3}
    - {fileID: 21300000, guid: bb6d3a5596a4a4d0088e43d33e55203b, type: 3}
    - {fileID: 21300000, guid: fe49f958ae8384af89d3cc43739fcaba, type: 3}
    - {fileID: 21300000, guid: dcb07a6eaa0ed4010bcda985bdd60331, type: 3}
    - {fileID: 21300000, guid: 5a0a6ee1e84ba4634b38ecc484f62b3f, type: 3}
    - {fileID: 21300000, guid: 787254d97a69248edabb81778f8517ba, type: 3}
    - {fileID: 21300000, guid: 0a3b2377869ca4743a4a42c7b3c6e5c9, type: 3}
    - {fileID: 21300000, guid: 89aef04d6a29b44c691507b3da018be4, type: 3}
  m_AnimationClipSettings:
    serializedVersion: 2
    m_AdditiveReferencePoseClip: {fileID: 0}
    m_AdditiveReferencePoseTime: 0
    m_StartTime: 0
    m_StopTime: 0.8666667
    m_OrientationOffsetY: 0
    m_Level: 0
    m_CycleOffset: 0
    m_HasAdditiveReferencePose: 0
    m_LoopTime: 0
    m_LoopBlend: 0
    m_LoopBlendOrientation: 0
    m_LoopBlendPositionY: 0
    m_LoopBlendPositionXZ: 0
    m_KeepOriginalOrientation: 0
    m_KeepOriginalPositionY: 1
    m_KeepOriginalPositionXZ: 0
    m_HeightFromFeet: 0
    m_Mirror: 0
  m_EditorCurves: []
  m_EulerEditorCurves: []
  m_HasGenericRootTransform: 0
  m_HasMotionFloatCurves: 0
  m_Events:
  - time: 0.8666667
    functionName: callRefreshDemo
    data: 
    objectReferenceParameter: {fileID: 0}
    floatParameter: 0
    intParameter: 0
    messageOptions: 0
