{"type":"root","options":{

},"size":{"width":1303,"height":374},"children":[{"name":"Screen 27","type":"group","options":{

},"offset":{"left":548,"top":134},"size":{"width":421,"height":155},"relativePath":"Screen 27","children":[{"name":"Shape1","type":"png","options":{

},"offset":{"left":562,"top":184},"size":{"width":393,"height":2},"relativePath":"Screen 27/Shape1","children":[

]},{"name":"A particular Oil field health status","type":"text","options":{"opacity":100,"textContents":"A particular Oil field health status","textFont":"AkkuratBoldBold","textSize":13,"textColor":{"red":166,"green":166,"blue":166},"textHorizontalWrap":false},"offset":{"left":605,"top":224},"size":{"width":253,"height":11},"relativePath":"Screen 27/A particular Oil field health status","children":[

]},{"name":"a particular pump jacks performance history","type":"text","options":{"opacity":100,"textContents":"a particular pump jacks performance history","textFont":"AkkuratBoldBold","textSize":13,"textColor":{"red":166,"green":166,"blue":166},"textHorizontalWrap":false},"offset":{"left":605,"top":199},"size":{"width":326,"height":11},"relativePath":"Screen 27/a particular pump jacks performance history","children":[

]},{"name":"Show me a field operators activity history","type":"text","options":{"opacity":100,"textContents":"Show me a field operators activity history","textFont":"AkkuratBoldBold","textSize":13,"textColor":{"red":255,"green":255,"blue":255},"textHorizontalWrap":false},"offset":{"left":606,"top":154},"size":{"width":301,"height":11},"relativePath":"Screen 27/Show me a field operators activity history","children":[

]},{"name":"Shape2","type":"png","options":{

},"offset":{"left":548,"top":134},"size":{"width":421,"height":155},"relativePath":"Screen 27/Shape2","children":[

]},{"name":"Shape4","type":"png","options":{

},"offset":{"left":533,"top":0},"size":{"width":455,"height":374},"relativePath":"Screen 27/Shape4","children":[

]},{"name":"Icon1","type":"png","options":{

},"offset":{"left":21,"top":52},"size":{"width":42,"height":47},"relativePath":"Screen 27/Icon1","children":[

]},{"name":"Icon3=PNG + Icon2","type":"png","options":{

},"offset":{"left":30,"top":146},"size":{"width":393,"height":25},"relativePath":"Screen 27/Icon3=PNG + Icon2","children":[

]},{"name":"Shape5","type":"png","options":{

},"offset":{"left":16,"top":134},"size":{"width":421,"height":50},"relativePath":"Screen 27/Shape5","children":[

]},{"name":"Shape6","type":"png","options":{

},"offset":{"left":20,"top":2},"size":{"width":435,"height":5},"relativePath":"Screen 27/Shape6","children":[

]},{"name":"HELLO! ASK ME YOUR QUERY","type":"text","options":{"opacity":100,"textContents":"HELLO! ASK ME YOUR QUERY","textFont":"AkkuratBoldBold","textSize":24,"textColor":{"red":255,"green":255,"blue":255},"textHorizontalWrap":false},"offset":{"left":76,"top":65},"size":{"width":328,"height":20},"relativePath":"Screen 27/HELLO! ASK ME YOUR QUERY","children":[

]},{"name":"Shape7","type":"png","options":{

},"offset":{"left":0,"top":5},"size":{"width":455,"height":285},"relativePath":"Screen 27/Shape7","children":[

]},{"name":"Icon4","type":"png","options":{

},"offset":{"left":1187,"top":105},"size":{"width":116,"height":132},"relativePath":"Screen 27/Icon4","children":[

]},{"name":"PETRO SEARCH","type":"text","options":{"opacity":100,"textContents":"PETRO SEARCH","textFont":"AkkuratBoldBold","textSize":17,"textColor":{"red":255,"green":174,"blue":17},"textHorizontalWrap":false},"offset":{"left":1055,"top":165},"size":{"width":121,"height":14},"relativePath":"Screen 27/PETRO SEARCH","children":[

]}]}]}
