%YAML 1.1
%TAG !u! tag:unity3d.com,2011:
--- !u!74 &7400000
AnimationClip:
  m_ObjectHideFlags: 0
  m_CorrespondingSourceObject: {fileID: 0}
  m_PrefabInstance: {fileID: 0}
  m_PrefabAsset: {fileID: 0}
  m_Name: GreenCircleHUDAnimationLoop
  serializedVersion: 6
  m_Legacy: 0
  m_Compressed: 0
  m_UseHighQualityCurve: 1
  m_RotationCurves: []
  m_CompressedRotationCurves: []
  m_EulerCurves: []
  m_PositionCurves: []
  m_ScaleCurves: []
  m_FloatCurves: []
  m_PPtrCurves:
  - curve:
    - time: 0
      value: {fileID: 21300000, guid: 4c3bc2720dd20460ab1059f6170cd288, type: 3}
    - time: 0.016666668
      value: {fileID: 21300000, guid: fd7dff813745f4fb8a6b307f9a28490d, type: 3}
    - time: 0.033333335
      value: {fileID: 21300000, guid: e13026df0176b453387a676889aef134, type: 3}
    - time: 0.05
      value: {fileID: 21300000, guid: 992bda466166e4234990f85af7b9d41e, type: 3}
    - time: 0.06666667
      value: {fileID: 21300000, guid: 85d00adc97a844c7f93c1f4c9545cc7e, type: 3}
    - time: 0.083333336
      value: {fileID: 21300000, guid: 3dfd0e44725ed478ab0168473efbd35a, type: 3}
    - time: 0.1
      value: {fileID: 21300000, guid: 8e9624a85d8524fd8a38fbb307a1f0cc, type: 3}
    - time: 0.11666667
      value: {fileID: 21300000, guid: 7b02bec6730d1479c98bd36c4ec89b9b, type: 3}
    - time: 0.13333334
      value: {fileID: 21300000, guid: 7f444632da56345cea6692e2667ff577, type: 3}
    - time: 0.15
      value: {fileID: 21300000, guid: 6f2b7c8f786be46ff879c6cf73acef1d, type: 3}
    - time: 0.16666667
      value: {fileID: 21300000, guid: a6d51bfa684ab407a86fe503b680dd20, type: 3}
    - time: 0.18333334
      value: {fileID: 21300000, guid: 06f28dec2056f471e99e32719667c914, type: 3}
    - time: 0.2
      value: {fileID: 21300000, guid: 91cf0c73ec8214bc1bd8fff98ce368e4, type: 3}
    - time: 0.21666667
      value: {fileID: 21300000, guid: 9bf202de07ac54971b50b097a9d6450b, type: 3}
    - time: 0.23333333
      value: {fileID: 21300000, guid: a7086048ec92748938e1a419e4a25d0a, type: 3}
    - time: 0.25
      value: {fileID: 21300000, guid: 89c6841dc7072489da6c66b842156d43, type: 3}
    - time: 0.26666668
      value: {fileID: 21300000, guid: fc5868ee6910d47bc9cb1d66a05f8689, type: 3}
    - time: 0.28333333
      value: {fileID: 21300000, guid: c6d3f5b203be441168319ea5da8120ec, type: 3}
    - time: 0.3
      value: {fileID: 21300000, guid: 3a90e25c5c67d4836b12e75d7fd29de2, type: 3}
    - time: 0.31666666
      value: {fileID: 21300000, guid: c7bc1ea6b2f024424a6fb9c697eb1f10, type: 3}
    - time: 0.33333334
      value: {fileID: 21300000, guid: e02f311435c2a4e0fa765d5ac97e6d73, type: 3}
    - time: 0.35
      value: {fileID: 21300000, guid: 82037a7007777489684bcc098b0cc0aa, type: 3}
    - time: 0.36666667
      value: {fileID: 21300000, guid: 8aaf79ea326ea469a84b1f88e36221ee, type: 3}
    - time: 0.38333333
      value: {fileID: 21300000, guid: 51b0653c06449457c83f3025b84c3825, type: 3}
    - time: 0.4
      value: {fileID: 21300000, guid: fb49365838a6a4e3eb82cf5a7827854c, type: 3}
    - time: 0.41666666
      value: {fileID: 21300000, guid: 9ebc63b16678d4917846f429b68640a1, type: 3}
    - time: 0.43333334
      value: {fileID: 21300000, guid: f1998b5066d22445899b4ed7d2cdb37f, type: 3}
    - time: 0.45
      value: {fileID: 21300000, guid: c95273941462b4a01b4a12b9111afa36, type: 3}
    - time: 0.46666667
      value: {fileID: 21300000, guid: 487466317d6e546b592ee9b1904fa370, type: 3}
    - time: 0.48333332
      value: {fileID: 21300000, guid: d044364d1056b4af48e2327e67d0f61a, type: 3}
    - time: 0.5
      value: {fileID: 21300000, guid: e452edaca7f294e29addc627c68ab99f, type: 3}
    - time: 0.51666665
      value: {fileID: 21300000, guid: 08d7edac338554fd9be74932a47fb324, type: 3}
    - time: 0.53333336
      value: {fileID: 21300000, guid: 49575383e84ea488fa3d0c296680f0e1, type: 3}
    - time: 0.55
      value: {fileID: 21300000, guid: 157bd526806f040359acc98f66f13bae, type: 3}
    - time: 0.56666666
      value: {fileID: 21300000, guid: e8e53d03a6cf3412481e9314a7bf1818, type: 3}
    - time: 0.5833333
      value: {fileID: 21300000, guid: 96afc4ecc7d2448e198c02258eae9c7a, type: 3}
    - time: 0.6
      value: {fileID: 21300000, guid: 3bf07335fd4714bb7bcdf889ca09aa6d, type: 3}
    - time: 0.6166667
      value: {fileID: 21300000, guid: 7d1bf72e0cf074a769e96c6b85c5809f, type: 3}
    - time: 0.6333333
      value: {fileID: 21300000, guid: 46c979c3826d7421e9117a93c0529774, type: 3}
    - time: 0.65
      value: {fileID: 21300000, guid: 4e4a31ecf685b4433942f1e81d5e7461, type: 3}
    - time: 0.6666667
      value: {fileID: 21300000, guid: c3136efc33a8e4f09a1b210343d9228b, type: 3}
    - time: 0.68333334
      value: {fileID: 21300000, guid: a251164bbcbbb41eb9e6d7fcd09c5a69, type: 3}
    - time: 0.7
      value: {fileID: 21300000, guid: fab522a4e5c874a3fb8171550f375733, type: 3}
    - time: 0.71666664
      value: {fileID: 21300000, guid: f89c5ab4ad9924ca5b64bbfee1896a89, type: 3}
    - time: 0.73333335
      value: {fileID: 21300000, guid: 5f08ac71baf0443cf82d8c45557ccf43, type: 3}
    - time: 0.75
      value: {fileID: 21300000, guid: f7f8e4b4c3aa44780a8fade35ebad410, type: 3}
    - time: 0.76666665
      value: {fileID: 21300000, guid: 2d9013356c9f94feca8e4cb6c8be0d25, type: 3}
    - time: 0.78333336
      value: {fileID: 21300000, guid: 728e2482dddce4f08857083a29642ccb, type: 3}
    - time: 0.8
      value: {fileID: 21300000, guid: 0dc05be2a445c4aadaabc029e57b82c3, type: 3}
    - time: 0.81666666
      value: {fileID: 21300000, guid: 816f4340d61634d32bba74c6f66960d9, type: 3}
    - time: 0.8333333
      value: {fileID: 21300000, guid: a403ac814ca054b40992b46d5ba8ac47, type: 3}
    - time: 0.85
      value: {fileID: 21300000, guid: 81e9c4ef46f3747e9a673998e896d371, type: 3}
    - time: 0.8666667
      value: {fileID: 21300000, guid: 3815acec8cfeb49c488b39eae00d550b, type: 3}
    - time: 0.8833333
      value: {fileID: 21300000, guid: ba71dd9b259d546ea8d95cf255a41e07, type: 3}
    - time: 0.9
      value: {fileID: 21300000, guid: ba77ab15c30b146d68d47e5fda3cc7da, type: 3}
    - time: 0.9166667
      value: {fileID: 21300000, guid: c09cc4c9c8dc14f3787e650299989990, type: 3}
    - time: 0.93333334
      value: {fileID: 21300000, guid: 874e37829a0344d9bbe5120b2a795aa4, type: 3}
    - time: 0.95
      value: {fileID: 21300000, guid: 77dcdfc00686a463a855e5bf89775626, type: 3}
    - time: 0.96666664
      value: {fileID: 21300000, guid: b82e892b8dac54dc8985112cc4e18890, type: 3}
    - time: 0.98333335
      value: {fileID: 21300000, guid: fb61622811d0e46c6b88967b9867d8d4, type: 3}
    - time: 1
      value: {fileID: 21300000, guid: cd336a962d9844d6b966cacebcf607af, type: 3}
    - time: 1.0166667
      value: {fileID: 21300000, guid: 18ed54a23863c4c128c6e1c521436a81, type: 3}
    - time: 1.0333333
      value: {fileID: 21300000, guid: 1dc75ccdc60bd4fd7a3af3a95156cb6e, type: 3}
    - time: 1.05
      value: {fileID: 21300000, guid: a77b38d19f3584d61a4b8343e2c20012, type: 3}
    - time: 1.0666667
      value: {fileID: 21300000, guid: ae4ff9c27dfd642e08c5a511c0bc7ea2, type: 3}
    - time: 1.0833334
      value: {fileID: 21300000, guid: d7e5b273285204756bf3848f8bea97ad, type: 3}
    - time: 1.1
      value: {fileID: 21300000, guid: 8294f70ca4a9c49feb8dbe168da0aaf9, type: 3}
    - time: 1.1166667
      value: {fileID: 21300000, guid: 20b1e07dcf7c74f738c8f62f3ca75495, type: 3}
    - time: 1.1333333
      value: {fileID: 21300000, guid: 9c5b7fa6d55c74e709c8588c56dfc7cd, type: 3}
    - time: 1.15
      value: {fileID: 21300000, guid: a9ec6f7b0ba364f0f8cd39322c7835c9, type: 3}
    - time: 1.1666666
      value: {fileID: 21300000, guid: a77bb8ae227324b31b5e90d2105d4392, type: 3}
    - time: 1.1833333
      value: {fileID: 21300000, guid: feca4bcfd13104d1c909af8590bf9635, type: 3}
    - time: 1.2
      value: {fileID: 21300000, guid: 0f161e00a062e463b88611ece58dac74, type: 3}
    - time: 1.2166667
      value: {fileID: 21300000, guid: 4225d40578861463888ba3eccb7a78e4, type: 3}
    - time: 1.2333333
      value: {fileID: 21300000, guid: e15fc7fa9e96d4f30b01ba82413a30a1, type: 3}
    - time: 1.25
      value: {fileID: 21300000, guid: d0ac4eb600a9f4ac4944cb34703feca2, type: 3}
    - time: 1.2666667
      value: {fileID: 21300000, guid: 3be8797542102453baab2419db65cc0f, type: 3}
    - time: 1.2833333
      value: {fileID: 21300000, guid: e2e5f9df6488946449e65d7af6b7cc39, type: 3}
    - time: 1.3
      value: {fileID: 21300000, guid: 78e58e6e736604b95a0c42d07b8c4c38, type: 3}
    - time: 1.3166667
      value: {fileID: 21300000, guid: cca61b2c128bc4eb88a21933e337e484, type: 3}
    - time: 1.3333334
      value: {fileID: 21300000, guid: 1a61ebc208d2244e895a676d2fd12623, type: 3}
    - time: 1.35
      value: {fileID: 21300000, guid: d2796bda6a4544ac18143255a6c5784c, type: 3}
    - time: 1.3666667
      value: {fileID: 21300000, guid: 70f5646ff7513450797f1a89357be153, type: 3}
    - time: 1.3833333
      value: {fileID: 21300000, guid: 60963ec0a2c5e453984699e8f2935148, type: 3}
    - time: 1.4
      value: {fileID: 21300000, guid: 66376e94de5ee4397a987d8d131ef562, type: 3}
    - time: 1.4166666
      value: {fileID: 21300000, guid: 638ac5c9cc62a4990a8930b79e34ff92, type: 3}
    - time: 1.4333333
      value: {fileID: 21300000, guid: 98cdfc45e556c4b2d85795fc07108020, type: 3}
    - time: 1.45
      value: {fileID: 21300000, guid: 6db1bb593d0cc4f0fb4c1d009a220c32, type: 3}
    - time: 1.4666667
      value: {fileID: 21300000, guid: ace8f5b59e5d7477ead210dc37df7ab2, type: 3}
    - time: 1.4833333
      value: {fileID: 21300000, guid: cb9de9ebab40c4d3fb6382bd74c12309, type: 3}
    - time: 1.5
      value: {fileID: 21300000, guid: 9a3e81f2f48e4491aa0587790006eb9a, type: 3}
    - time: 1.5166667
      value: {fileID: 21300000, guid: 7f23074dcb2d7471a9246f41f7f85f45, type: 3}
    - time: 1.5333333
      value: {fileID: 21300000, guid: cd3b1f825a13744b196686424e3b0339, type: 3}
    - time: 1.55
      value: {fileID: 21300000, guid: caf4831e9575c43d197043ea62d315be, type: 3}
    - time: 1.5666667
      value: {fileID: 21300000, guid: 2aa95b9ff8b9d449493121e459c1e589, type: 3}
    - time: 1.5833334
      value: {fileID: 21300000, guid: 54f3a382f5fc44311ab79de98a3a8595, type: 3}
    - time: 1.6
      value: {fileID: 21300000, guid: 4131cd2a4dfd84dc09f3eb1cfad13ccd, type: 3}
    - time: 1.6166667
      value: {fileID: 21300000, guid: 351490adc359f43a8b03d0a26fcd88db, type: 3}
    - time: 1.6333333
      value: {fileID: 21300000, guid: db0a4e9bb77ed4de194f28825f09a92a, type: 3}
    - time: 1.65
      value: {fileID: 21300000, guid: 6534e08d0615d4a31bb98d5444b62222, type: 3}
    - time: 1.6666666
      value: {fileID: 21300000, guid: 72e4d866494ca4dc7846f74874144cb9, type: 3}
    - time: 1.6833333
      value: {fileID: 21300000, guid: 9bdca1c60458d4c3bb2e7489626d869e, type: 3}
    - time: 1.7
      value: {fileID: 21300000, guid: eaa666e9ee4af4317beb8688471f049b, type: 3}
    - time: 1.7166667
      value: {fileID: 21300000, guid: 0ed9249d7be484908bca413aeb42e3ff, type: 3}
    - time: 1.7333333
      value: {fileID: 21300000, guid: 0c785aef3c7ec42448efdcea1c3c9c98, type: 3}
    - time: 1.75
      value: {fileID: 21300000, guid: df38003ec1d1f4f348cf8f13979c7dc6, type: 3}
    - time: 1.7666667
      value: {fileID: 21300000, guid: 39c44fa54444f449699f1d86a472d033, type: 3}
    - time: 1.7833333
      value: {fileID: 21300000, guid: 6a9bca27c328540a89933589977cecfa, type: 3}
    - time: 1.8
      value: {fileID: 21300000, guid: 34ac43dd4d7af4e80952853a964800ad, type: 3}
    - time: 1.8166667
      value: {fileID: 21300000, guid: 1d5e99a1a33394f7c89cf9488c7f4f8c, type: 3}
    - time: 1.8333334
      value: {fileID: 21300000, guid: 172c7da13ed58407583c156bc919d56c, type: 3}
    - time: 1.85
      value: {fileID: 21300000, guid: 7309fa482de1040a0b63cd07fa16dd25, type: 3}
    - time: 1.8666667
      value: {fileID: 21300000, guid: f61dd039b606247028082d2e7713ea23, type: 3}
    - time: 1.8833333
      value: {fileID: 21300000, guid: ac510b0c9cc7c426697fbee5807f5e53, type: 3}
    - time: 1.9
      value: {fileID: 21300000, guid: 3978cd9dd59db44eaa6a7ff04491dd91, type: 3}
    - time: 1.9166666
      value: {fileID: 21300000, guid: 42d9c543fca644472818e960c6c19f9c, type: 3}
    - time: 1.9333333
      value: {fileID: 21300000, guid: 9fbee438d011049fea19e9a75a0e8fba, type: 3}
    - time: 1.95
      value: {fileID: 21300000, guid: 810bb0fb039c54380acb00b031a6b2f8, type: 3}
    - time: 1.9666667
      value: {fileID: 21300000, guid: 80a7a011fd21f4991ae200018afe20af, type: 3}
    - time: 1.9833333
      value: {fileID: 21300000, guid: f397cf37d33334a76906cf695f321377, type: 3}
    - time: 2
      value: {fileID: 21300000, guid: d64c5a97c5c084b95bd3ec8fe1031289, type: 3}
    - time: 2.0166667
      value: {fileID: 21300000, guid: d1c5f0700b84c44d2b58b74cf8d67981, type: 3}
    - time: 2.0333333
      value: {fileID: 21300000, guid: bbb4a2bb97e8642b296679ce0c10f074, type: 3}
    - time: 2.05
      value: {fileID: 21300000, guid: d091f63bfe2f14a8ea0e54938146143f, type: 3}
    - time: 2.0666666
      value: {fileID: 21300000, guid: 842a322046abd44d0ab216b18a3d654a, type: 3}
    - time: 2.0833333
      value: {fileID: 21300000, guid: 0925733ac320c41aca52be75216c7b69, type: 3}
    - time: 2.1
      value: {fileID: 21300000, guid: d1e919a001aca4a75bd09e123e55e013, type: 3}
    - time: 2.1166666
      value: {fileID: 21300000, guid: 5998c3ab5a9d248199a52c8f0c167a95, type: 3}
    - time: 2.1333334
      value: {fileID: 21300000, guid: 8a3651c39a0c147c49d13c3e101acdb6, type: 3}
    - time: 2.15
      value: {fileID: 21300000, guid: 63a77336a7dc443eabd4a18a4a48a9d6, type: 3}
    - time: 2.1666667
      value: {fileID: 21300000, guid: 93b2fe455a7a243f1a735052bca2f1e6, type: 3}
    - time: 2.1833334
      value: {fileID: 21300000, guid: e7baa900014fb41bfa70bdc592d21be1, type: 3}
    - time: 2.2
      value: {fileID: 21300000, guid: 20ab1a45a9cf04886860c00afee2a17a, type: 3}
    - time: 2.2166667
      value: {fileID: 21300000, guid: 5d955e29b84524388ba44a907a5d920d, type: 3}
    - time: 2.2333333
      value: {fileID: 21300000, guid: 520eee391007b4b32bc7964a9a452a6c, type: 3}
    - time: 2.25
      value: {fileID: 21300000, guid: e998c68c1e53b4ac3bbf5053184d07d5, type: 3}
    - time: 2.2666667
      value: {fileID: 21300000, guid: 95b9112e8a94d49e5850c561506b5e0e, type: 3}
    - time: 2.2833333
      value: {fileID: 21300000, guid: 40698bc941f3b42768472c039d4148f0, type: 3}
    - time: 2.3
      value: {fileID: 21300000, guid: 37e341782896841d0b3dc2a4f5ca0a2c, type: 3}
    - time: 2.3166666
      value: {fileID: 21300000, guid: 8d46b19f1ce874e5eac051d445a79b2a, type: 3}
    - time: 2.3333333
      value: {fileID: 21300000, guid: 88cce49c709e84a1abe85e23006c094b, type: 3}
    - time: 2.35
      value: {fileID: 21300000, guid: 28d1f050190314c77be0dc63a45e655e, type: 3}
    - time: 2.3666666
      value: {fileID: 21300000, guid: 75322fa0a09e145fb8f45fdc654d255e, type: 3}
    - time: 2.3833334
      value: {fileID: 21300000, guid: 123116b977c4d4575a64086a1cb94c3f, type: 3}
    - time: 2.4
      value: {fileID: 21300000, guid: 302cd23a799d744e89ff50cd2984fd79, type: 3}
    - time: 2.4166667
      value: {fileID: 21300000, guid: a75b44b5c2d5e4619ab88951485ea1af, type: 3}
    - time: 2.4333334
      value: {fileID: 21300000, guid: 956963cb57ae942f590ff8908ee7ba8f, type: 3}
    - time: 2.45
      value: {fileID: 21300000, guid: 210e7a7b3e71b42a2aeb369971fbb331, type: 3}
    - time: 2.4666667
      value: {fileID: 21300000, guid: 2fcebf2fec6334255a1d064c13abad9c, type: 3}
    - time: 2.4833333
      value: {fileID: 21300000, guid: d004bf4de32ed4290ac35cb48aa915ab, type: 3}
    - time: 2.5
      value: {fileID: 21300000, guid: 7333c1862093d4f4bbcf690098a389d5, type: 3}
    - time: 2.5166667
      value: {fileID: 21300000, guid: cea7e8fe2f47e44c89c6bcc9327810ef, type: 3}
    - time: 2.5333333
      value: {fileID: 21300000, guid: 0d3cb7abf804c44b69efd9c7fb1fc72e, type: 3}
    - time: 2.55
      value: {fileID: 21300000, guid: 0ffed9d114ee443a79658065ad4573f1, type: 3}
    - time: 2.5666666
      value: {fileID: 21300000, guid: 9c51a415b47224210a9381f1ef8002aa, type: 3}
    - time: 2.5833333
      value: {fileID: 21300000, guid: e48676433b5ec4b509928be4e2009004, type: 3}
    - time: 2.6
      value: {fileID: 21300000, guid: c1e5c3978b205408a9ffc125ca4d4d51, type: 3}
    - time: 2.6166666
      value: {fileID: 21300000, guid: 4b42ed0be9d1e407d9b7fd49ecde6a67, type: 3}
    - time: 2.6333334
      value: {fileID: 21300000, guid: 5dd040de9848246aaaf70cf3278540bb, type: 3}
    - time: 2.65
      value: {fileID: 21300000, guid: b029146194f334bb4814c3257113fad4, type: 3}
    - time: 2.6666667
      value: {fileID: 21300000, guid: 186a47642b63e4a9f87a124793c7aa3b, type: 3}
    - time: 2.6833334
      value: {fileID: 21300000, guid: 808ca0364849c46b39a18f1a798fa6c4, type: 3}
    - time: 2.7
      value: {fileID: 21300000, guid: d4380d1bfe1954b8ea0a5bb3cc48a4d4, type: 3}
    - time: 2.7166667
      value: {fileID: 21300000, guid: 9e4327576a1064cb9942c9833c13029f, type: 3}
    - time: 2.7333333
      value: {fileID: 21300000, guid: 2c2ba20500e4447c9b046339c5393f8b, type: 3}
    - time: 2.75
      value: {fileID: 21300000, guid: eb5495b1e9ead420db4df666ddc7b860, type: 3}
    - time: 2.7666667
      value: {fileID: 21300000, guid: ded5795570ff64733ab4702ca0468fb3, type: 3}
    - time: 2.7833333
      value: {fileID: 21300000, guid: 919ced67f320449bb84df7ed754396ac, type: 3}
    - time: 2.8
      value: {fileID: 21300000, guid: 709c47606e441459bae2ff87fa339654, type: 3}
    - time: 2.8166666
      value: {fileID: 21300000, guid: 12d43bc4ffeb646fd8a745fafa323225, type: 3}
    - time: 2.8333333
      value: {fileID: 21300000, guid: 72f46d2fc0527451596337d3f6812c12, type: 3}
    - time: 2.85
      value: {fileID: 21300000, guid: 5e8b21be2c8e84981a277bdaedf85e2b, type: 3}
    - time: 2.8666666
      value: {fileID: 21300000, guid: 67dc67b9879994ddb8a9c3d354d21c6a, type: 3}
    - time: 2.8833334
      value: {fileID: 21300000, guid: bc04f0d5fa3d4446baaeeba7fccbf95d, type: 3}
    - time: 2.9
      value: {fileID: 21300000, guid: 23fd0fd9cffef4e47b36d1fcae2ba8d9, type: 3}
    - time: 2.9166667
      value: {fileID: 21300000, guid: 27f02b27f567244489af4221b362e808, type: 3}
    - time: 2.9333334
      value: {fileID: 21300000, guid: e858030072ddf4eaa8d0822600ce4c14, type: 3}
    - time: 2.95
      value: {fileID: 21300000, guid: 13f85e89887f64c2387a8c2ddc337acc, type: 3}
    - time: 2.9666667
      value: {fileID: 21300000, guid: 4a17089b17b48402cb835b04654cd77c, type: 3}
    - time: 2.9833333
      value: {fileID: 21300000, guid: 7803922c8ecc74890bb19a9eeff0a0da, type: 3}
    - time: 3
      value: {fileID: 21300000, guid: 19ea10061fe0d42379c809c0cb28517c, type: 3}
    - time: 3.0166667
      value: {fileID: 21300000, guid: 4d765be87c80b4a0398965977da0cfe8, type: 3}
    - time: 3.0333333
      value: {fileID: 21300000, guid: 9ec9b19e9d9084e75aebfc8f054b15c7, type: 3}
    - time: 3.05
      value: {fileID: 21300000, guid: 92267aa0a3546477f9e28addfffa24de, type: 3}
    - time: 3.0666666
      value: {fileID: 21300000, guid: 042a65ed42416449daae59ace03a2fc1, type: 3}
    - time: 3.0833333
      value: {fileID: 21300000, guid: d62ac6b9c0aa643c59fd23372429b699, type: 3}
    - time: 3.1
      value: {fileID: 21300000, guid: 21912e7bb938c4feb91db71e341e9eb5, type: 3}
    - time: 3.1166666
      value: {fileID: 21300000, guid: 6820e9bf342514d069b606ee0ea327f4, type: 3}
    - time: 3.1333334
      value: {fileID: 21300000, guid: b56e2c50f2b344037903ba959eb37928, type: 3}
    - time: 3.15
      value: {fileID: 21300000, guid: 980571e7215e540d39a8d715d1e73a66, type: 3}
    - time: 3.1666667
      value: {fileID: 21300000, guid: 9f008c771ac504a9d8fbd86612d2d771, type: 3}
    - time: 3.1833334
      value: {fileID: 21300000, guid: 5e1bf018ab190435c9b454475f58579d, type: 3}
    - time: 3.2
      value: {fileID: 21300000, guid: 7c26c98f8903f420597ad8702b335e55, type: 3}
    - time: 3.2166667
      value: {fileID: 21300000, guid: 72e00b9c28d48477cbbd8e5287c408ce, type: 3}
    - time: 3.2333333
      value: {fileID: 21300000, guid: 83ef58a697fc04e3ea02d54ef764d11c, type: 3}
    - time: 3.25
      value: {fileID: 21300000, guid: e87c6bef5999444d1879740e2085395b, type: 3}
    - time: 3.2666667
      value: {fileID: 21300000, guid: 6ec66e346d3b8467b926277759e80f8d, type: 3}
    - time: 3.2833333
      value: {fileID: 21300000, guid: f66ef816f6d624e7aa50126862ca26f1, type: 3}
    - time: 3.3
      value: {fileID: 21300000, guid: ff97a6ede1071469898dea929e21f204, type: 3}
    - time: 3.3166666
      value: {fileID: 21300000, guid: 64550997af8fb4527b8c0207aa16a424, type: 3}
    - time: 3.3333333
      value: {fileID: 21300000, guid: 3c9430d3ebabe435facb036b7084ddcc, type: 3}
    - time: 3.35
      value: {fileID: 21300000, guid: b82ceeeab15eb4fe09f69c6d231b1f11, type: 3}
    - time: 3.3666666
      value: {fileID: 21300000, guid: 799ff43a60648431b8a6ed63f33a2729, type: 3}
    - time: 3.3833334
      value: {fileID: 21300000, guid: 30cba1d8d5266413db3a1d6e62d0d298, type: 3}
    - time: 3.4
      value: {fileID: 21300000, guid: 54d5f6079d6a440e8b4b488b420543f7, type: 3}
    - time: 3.4166667
      value: {fileID: 21300000, guid: 0a0653639c16140a5b63f94d68f0b8e4, type: 3}
    - time: 3.4333334
      value: {fileID: 21300000, guid: 08c3ba2e930744061a94e60413689f38, type: 3}
    - time: 3.45
      value: {fileID: 21300000, guid: 4f8c1965b287343e6b68c98d048ddda4, type: 3}
    - time: 3.4666667
      value: {fileID: 21300000, guid: 82cd853cc43d147b8abe8335fb798941, type: 3}
    - time: 3.4833333
      value: {fileID: 21300000, guid: 7266767f379d947b9b9ce4dcadcd064a, type: 3}
    - time: 3.5
      value: {fileID: 21300000, guid: 5c081583a82d445f1ad593beb6ce1560, type: 3}
    - time: 3.5166667
      value: {fileID: 21300000, guid: 12df52c5f07cc4ac488c39dfc8c634dd, type: 3}
    - time: 3.5333333
      value: {fileID: 21300000, guid: 6b398b5a5b54c46758d8f16016ac4bb5, type: 3}
    - time: 3.55
      value: {fileID: 21300000, guid: 2e03e1d6770e441b3ac7027fb89a4827, type: 3}
    - time: 3.5666666
      value: {fileID: 21300000, guid: 59b77cd5b114842c7934b095aa7dfcf2, type: 3}
    - time: 3.5833333
      value: {fileID: 21300000, guid: e31c90358acda44e28f77e51c6b91b57, type: 3}
    - time: 3.6
      value: {fileID: 21300000, guid: 5d9f5d4df4b3b42bdbdcd21e6864a641, type: 3}
    - time: 3.6166666
      value: {fileID: 21300000, guid: 0656ff1ae6cfa4535b371f8dd15c97fd, type: 3}
    - time: 3.6333334
      value: {fileID: 21300000, guid: 5465d3de35cea4217bfe5908914a5507, type: 3}
    - time: 3.65
      value: {fileID: 21300000, guid: cef8ae8f952a449cfbc4b61fc225567c, type: 3}
    - time: 3.6666667
      value: {fileID: 21300000, guid: 40f5d9e1a73b84d4b9f7454c7a1cede8, type: 3}
    - time: 3.6833334
      value: {fileID: 21300000, guid: 0fece70ddd5cc4838995873a5ddae59f, type: 3}
    - time: 3.7
      value: {fileID: 21300000, guid: 1742bc07bc7674e50aa163648f4514a9, type: 3}
    - time: 3.7166667
      value: {fileID: 21300000, guid: 3364fd379c2e5468a93c3072f9e0339d, type: 3}
    - time: 3.7333333
      value: {fileID: 21300000, guid: d5815a00808854167a6fed9bcf1b1f5f, type: 3}
    - time: 3.75
      value: {fileID: 21300000, guid: e69833f13407f4322af631df8d2df4fa, type: 3}
    - time: 3.7666667
      value: {fileID: 21300000, guid: e0996d7aa9e7242fb91c9f4b614dba61, type: 3}
    - time: 3.7833333
      value: {fileID: 21300000, guid: 696591f640a6b4b92bf092e66390ed2d, type: 3}
    - time: 3.8
      value: {fileID: 21300000, guid: a3010bbf881444f9b877a8a3b368c4fe, type: 3}
    - time: 3.8166666
      value: {fileID: 21300000, guid: 0672ae75fa4fd47048527c083a12d91e, type: 3}
    - time: 3.8333333
      value: {fileID: 21300000, guid: 9c6660b94a4574d35a055952c0c856ed, type: 3}
    - time: 3.85
      value: {fileID: 21300000, guid: f622628dafe0c4366b9b9c2a7c27f3ac, type: 3}
    - time: 3.8666666
      value: {fileID: 21300000, guid: 482e2c9ce6cb947ab8928e87b81d71d7, type: 3}
    - time: 3.8833334
      value: {fileID: 21300000, guid: 4139b7c02872e422e92d8c313a797246, type: 3}
    - time: 3.9
      value: {fileID: 21300000, guid: 4b9396f1277c14e30b66198963d665f1, type: 3}
    - time: 3.9166667
      value: {fileID: 21300000, guid: e9e28a45876404e5dabc1ad6cf3f6012, type: 3}
    - time: 3.9333334
      value: {fileID: 21300000, guid: bc88c8a565d394edaa9eb42c2d66c933, type: 3}
    - time: 3.95
      value: {fileID: 21300000, guid: ccc05782c280b44b08ddc33223677379, type: 3}
    - time: 3.9666667
      value: {fileID: 21300000, guid: a0f62fae25e4141e194cdc943d62801f, type: 3}
    - time: 3.9833333
      value: {fileID: 21300000, guid: 53644106f39bf4181aed117d452fc39e, type: 3}
    - time: 4
      value: {fileID: 21300000, guid: 37b120af6b5124667be1f8df50064c9b, type: 3}
    - time: 4.016667
      value: {fileID: 21300000, guid: 65446ca6a6faa400988be02dce02ecfc, type: 3}
    - time: 4.0333333
      value: {fileID: 21300000, guid: 14d3ea56324074cddaec70e5e7f1575a, type: 3}
    - time: 4.05
      value: {fileID: 21300000, guid: 62c6e6ea8a0b0445ab4b089a6c5c8e9f, type: 3}
    - time: 4.0666666
      value: {fileID: 21300000, guid: 9d80a84692b67402a917c226f9b38824, type: 3}
    - time: 4.0833335
      value: {fileID: 21300000, guid: de44b2f593cb34743b9c77b4a454ec5a, type: 3}
    - time: 4.1
      value: {fileID: 21300000, guid: 6f935b3fca172468e96536427fe09e86, type: 3}
    - time: 4.116667
      value: {fileID: 21300000, guid: 0f4a42f167fcc4979896915d64fbd8ae, type: 3}
    - time: 4.133333
      value: {fileID: 21300000, guid: d725f3f0edb6d429da4a401b74b63afb, type: 3}
    - time: 4.15
      value: {fileID: 21300000, guid: 83d7e8c2567414230be310a1d8382885, type: 3}
    - time: 4.1666665
      value: {fileID: 21300000, guid: ea357d8e6f4974388b30b583f205ecff, type: 3}
    attribute: m_Sprite
    path: 
    classID: 212
    script: {fileID: 0}
  m_SampleRate: 60
  m_WrapMode: 0
  m_Bounds:
    m_Center: {x: 0, y: 0, z: 0}
    m_Extent: {x: 0, y: 0, z: 0}
  m_ClipBindingConstant:
    genericBindings:
    - serializedVersion: 2
      path: 0
      attribute: 0
      script: {fileID: 0}
      typeID: 212
      customType: 23
      isPPtrCurve: 1
    pptrCurveMapping:
    - {fileID: 21300000, guid: 4c3bc2720dd20460ab1059f6170cd288, type: 3}
    - {fileID: 21300000, guid: fd7dff813745f4fb8a6b307f9a28490d, type: 3}
    - {fileID: 21300000, guid: e13026df0176b453387a676889aef134, type: 3}
    - {fileID: 21300000, guid: 992bda466166e4234990f85af7b9d41e, type: 3}
    - {fileID: 21300000, guid: 85d00adc97a844c7f93c1f4c9545cc7e, type: 3}
    - {fileID: 21300000, guid: 3dfd0e44725ed478ab0168473efbd35a, type: 3}
    - {fileID: 21300000, guid: 8e9624a85d8524fd8a38fbb307a1f0cc, type: 3}
    - {fileID: 21300000, guid: 7b02bec6730d1479c98bd36c4ec89b9b, type: 3}
    - {fileID: 21300000, guid: 7f444632da56345cea6692e2667ff577, type: 3}
    - {fileID: 21300000, guid: 6f2b7c8f786be46ff879c6cf73acef1d, type: 3}
    - {fileID: 21300000, guid: a6d51bfa684ab407a86fe503b680dd20, type: 3}
    - {fileID: 21300000, guid: 06f28dec2056f471e99e32719667c914, type: 3}
    - {fileID: 21300000, guid: 91cf0c73ec8214bc1bd8fff98ce368e4, type: 3}
    - {fileID: 21300000, guid: 9bf202de07ac54971b50b097a9d6450b, type: 3}
    - {fileID: 21300000, guid: a7086048ec92748938e1a419e4a25d0a, type: 3}
    - {fileID: 21300000, guid: 89c6841dc7072489da6c66b842156d43, type: 3}
    - {fileID: 21300000, guid: fc5868ee6910d47bc9cb1d66a05f8689, type: 3}
    - {fileID: 21300000, guid: c6d3f5b203be441168319ea5da8120ec, type: 3}
    - {fileID: 21300000, guid: 3a90e25c5c67d4836b12e75d7fd29de2, type: 3}
    - {fileID: 21300000, guid: c7bc1ea6b2f024424a6fb9c697eb1f10, type: 3}
    - {fileID: 21300000, guid: e02f311435c2a4e0fa765d5ac97e6d73, type: 3}
    - {fileID: 21300000, guid: 82037a7007777489684bcc098b0cc0aa, type: 3}
    - {fileID: 21300000, guid: 8aaf79ea326ea469a84b1f88e36221ee, type: 3}
    - {fileID: 21300000, guid: 51b0653c06449457c83f3025b84c3825, type: 3}
    - {fileID: 21300000, guid: fb49365838a6a4e3eb82cf5a7827854c, type: 3}
    - {fileID: 21300000, guid: 9ebc63b16678d4917846f429b68640a1, type: 3}
    - {fileID: 21300000, guid: f1998b5066d22445899b4ed7d2cdb37f, type: 3}
    - {fileID: 21300000, guid: c95273941462b4a01b4a12b9111afa36, type: 3}
    - {fileID: 21300000, guid: 487466317d6e546b592ee9b1904fa370, type: 3}
    - {fileID: 21300000, guid: d044364d1056b4af48e2327e67d0f61a, type: 3}
    - {fileID: 21300000, guid: e452edaca7f294e29addc627c68ab99f, type: 3}
    - {fileID: 21300000, guid: 08d7edac338554fd9be74932a47fb324, type: 3}
    - {fileID: 21300000, guid: 49575383e84ea488fa3d0c296680f0e1, type: 3}
    - {fileID: 21300000, guid: 157bd526806f040359acc98f66f13bae, type: 3}
    - {fileID: 21300000, guid: e8e53d03a6cf3412481e9314a7bf1818, type: 3}
    - {fileID: 21300000, guid: 96afc4ecc7d2448e198c02258eae9c7a, type: 3}
    - {fileID: 21300000, guid: 3bf07335fd4714bb7bcdf889ca09aa6d, type: 3}
    - {fileID: 21300000, guid: 7d1bf72e0cf074a769e96c6b85c5809f, type: 3}
    - {fileID: 21300000, guid: 46c979c3826d7421e9117a93c0529774, type: 3}
    - {fileID: 21300000, guid: 4e4a31ecf685b4433942f1e81d5e7461, type: 3}
    - {fileID: 21300000, guid: c3136efc33a8e4f09a1b210343d9228b, type: 3}
    - {fileID: 21300000, guid: a251164bbcbbb41eb9e6d7fcd09c5a69, type: 3}
    - {fileID: 21300000, guid: fab522a4e5c874a3fb8171550f375733, type: 3}
    - {fileID: 21300000, guid: f89c5ab4ad9924ca5b64bbfee1896a89, type: 3}
    - {fileID: 21300000, guid: 5f08ac71baf0443cf82d8c45557ccf43, type: 3}
    - {fileID: 21300000, guid: f7f8e4b4c3aa44780a8fade35ebad410, type: 3}
    - {fileID: 21300000, guid: 2d9013356c9f94feca8e4cb6c8be0d25, type: 3}
    - {fileID: 21300000, guid: 728e2482dddce4f08857083a29642ccb, type: 3}
    - {fileID: 21300000, guid: 0dc05be2a445c4aadaabc029e57b82c3, type: 3}
    - {fileID: 21300000, guid: 816f4340d61634d32bba74c6f66960d9, type: 3}
    - {fileID: 21300000, guid: a403ac814ca054b40992b46d5ba8ac47, type: 3}
    - {fileID: 21300000, guid: 81e9c4ef46f3747e9a673998e896d371, type: 3}
    - {fileID: 21300000, guid: 3815acec8cfeb49c488b39eae00d550b, type: 3}
    - {fileID: 21300000, guid: ba71dd9b259d546ea8d95cf255a41e07, type: 3}
    - {fileID: 21300000, guid: ba77ab15c30b146d68d47e5fda3cc7da, type: 3}
    - {fileID: 21300000, guid: c09cc4c9c8dc14f3787e650299989990, type: 3}
    - {fileID: 21300000, guid: 874e37829a0344d9bbe5120b2a795aa4, type: 3}
    - {fileID: 21300000, guid: 77dcdfc00686a463a855e5bf89775626, type: 3}
    - {fileID: 21300000, guid: b82e892b8dac54dc8985112cc4e18890, type: 3}
    - {fileID: 21300000, guid: fb61622811d0e46c6b88967b9867d8d4, type: 3}
    - {fileID: 21300000, guid: cd336a962d9844d6b966cacebcf607af, type: 3}
    - {fileID: 21300000, guid: 18ed54a23863c4c128c6e1c521436a81, type: 3}
    - {fileID: 21300000, guid: 1dc75ccdc60bd4fd7a3af3a95156cb6e, type: 3}
    - {fileID: 21300000, guid: a77b38d19f3584d61a4b8343e2c20012, type: 3}
    - {fileID: 21300000, guid: ae4ff9c27dfd642e08c5a511c0bc7ea2, type: 3}
    - {fileID: 21300000, guid: d7e5b273285204756bf3848f8bea97ad, type: 3}
    - {fileID: 21300000, guid: 8294f70ca4a9c49feb8dbe168da0aaf9, type: 3}
    - {fileID: 21300000, guid: 20b1e07dcf7c74f738c8f62f3ca75495, type: 3}
    - {fileID: 21300000, guid: 9c5b7fa6d55c74e709c8588c56dfc7cd, type: 3}
    - {fileID: 21300000, guid: a9ec6f7b0ba364f0f8cd39322c7835c9, type: 3}
    - {fileID: 21300000, guid: a77bb8ae227324b31b5e90d2105d4392, type: 3}
    - {fileID: 21300000, guid: feca4bcfd13104d1c909af8590bf9635, type: 3}
    - {fileID: 21300000, guid: 0f161e00a062e463b88611ece58dac74, type: 3}
    - {fileID: 21300000, guid: 4225d40578861463888ba3eccb7a78e4, type: 3}
    - {fileID: 21300000, guid: e15fc7fa9e96d4f30b01ba82413a30a1, type: 3}
    - {fileID: 21300000, guid: d0ac4eb600a9f4ac4944cb34703feca2, type: 3}
    - {fileID: 21300000, guid: 3be8797542102453baab2419db65cc0f, type: 3}
    - {fileID: 21300000, guid: e2e5f9df6488946449e65d7af6b7cc39, type: 3}
    - {fileID: 21300000, guid: 78e58e6e736604b95a0c42d07b8c4c38, type: 3}
    - {fileID: 21300000, guid: cca61b2c128bc4eb88a21933e337e484, type: 3}
    - {fileID: 21300000, guid: 1a61ebc208d2244e895a676d2fd12623, type: 3}
    - {fileID: 21300000, guid: d2796bda6a4544ac18143255a6c5784c, type: 3}
    - {fileID: 21300000, guid: 70f5646ff7513450797f1a89357be153, type: 3}
    - {fileID: 21300000, guid: 60963ec0a2c5e453984699e8f2935148, type: 3}
    - {fileID: 21300000, guid: 66376e94de5ee4397a987d8d131ef562, type: 3}
    - {fileID: 21300000, guid: 638ac5c9cc62a4990a8930b79e34ff92, type: 3}
    - {fileID: 21300000, guid: 98cdfc45e556c4b2d85795fc07108020, type: 3}
    - {fileID: 21300000, guid: 6db1bb593d0cc4f0fb4c1d009a220c32, type: 3}
    - {fileID: 21300000, guid: ace8f5b59e5d7477ead210dc37df7ab2, type: 3}
    - {fileID: 21300000, guid: cb9de9ebab40c4d3fb6382bd74c12309, type: 3}
    - {fileID: 21300000, guid: 9a3e81f2f48e4491aa0587790006eb9a, type: 3}
    - {fileID: 21300000, guid: 7f23074dcb2d7471a9246f41f7f85f45, type: 3}
    - {fileID: 21300000, guid: cd3b1f825a13744b196686424e3b0339, type: 3}
    - {fileID: 21300000, guid: caf4831e9575c43d197043ea62d315be, type: 3}
    - {fileID: 21300000, guid: 2aa95b9ff8b9d449493121e459c1e589, type: 3}
    - {fileID: 21300000, guid: 54f3a382f5fc44311ab79de98a3a8595, type: 3}
    - {fileID: 21300000, guid: 4131cd2a4dfd84dc09f3eb1cfad13ccd, type: 3}
    - {fileID: 21300000, guid: 351490adc359f43a8b03d0a26fcd88db, type: 3}
    - {fileID: 21300000, guid: db0a4e9bb77ed4de194f28825f09a92a, type: 3}
    - {fileID: 21300000, guid: 6534e08d0615d4a31bb98d5444b62222, type: 3}
    - {fileID: 21300000, guid: 72e4d866494ca4dc7846f74874144cb9, type: 3}
    - {fileID: 21300000, guid: 9bdca1c60458d4c3bb2e7489626d869e, type: 3}
    - {fileID: 21300000, guid: eaa666e9ee4af4317beb8688471f049b, type: 3}
    - {fileID: 21300000, guid: 0ed9249d7be484908bca413aeb42e3ff, type: 3}
    - {fileID: 21300000, guid: 0c785aef3c7ec42448efdcea1c3c9c98, type: 3}
    - {fileID: 21300000, guid: df38003ec1d1f4f348cf8f13979c7dc6, type: 3}
    - {fileID: 21300000, guid: 39c44fa54444f449699f1d86a472d033, type: 3}
    - {fileID: 21300000, guid: 6a9bca27c328540a89933589977cecfa, type: 3}
    - {fileID: 21300000, guid: 34ac43dd4d7af4e80952853a964800ad, type: 3}
    - {fileID: 21300000, guid: 1d5e99a1a33394f7c89cf9488c7f4f8c, type: 3}
    - {fileID: 21300000, guid: 172c7da13ed58407583c156bc919d56c, type: 3}
    - {fileID: 21300000, guid: 7309fa482de1040a0b63cd07fa16dd25, type: 3}
    - {fileID: 21300000, guid: f61dd039b606247028082d2e7713ea23, type: 3}
    - {fileID: 21300000, guid: ac510b0c9cc7c426697fbee5807f5e53, type: 3}
    - {fileID: 21300000, guid: 3978cd9dd59db44eaa6a7ff04491dd91, type: 3}
    - {fileID: 21300000, guid: 42d9c543fca644472818e960c6c19f9c, type: 3}
    - {fileID: 21300000, guid: 9fbee438d011049fea19e9a75a0e8fba, type: 3}
    - {fileID: 21300000, guid: 810bb0fb039c54380acb00b031a6b2f8, type: 3}
    - {fileID: 21300000, guid: 80a7a011fd21f4991ae200018afe20af, type: 3}
    - {fileID: 21300000, guid: f397cf37d33334a76906cf695f321377, type: 3}
    - {fileID: 21300000, guid: d64c5a97c5c084b95bd3ec8fe1031289, type: 3}
    - {fileID: 21300000, guid: d1c5f0700b84c44d2b58b74cf8d67981, type: 3}
    - {fileID: 21300000, guid: bbb4a2bb97e8642b296679ce0c10f074, type: 3}
    - {fileID: 21300000, guid: d091f63bfe2f14a8ea0e54938146143f, type: 3}
    - {fileID: 21300000, guid: 842a322046abd44d0ab216b18a3d654a, type: 3}
    - {fileID: 21300000, guid: 0925733ac320c41aca52be75216c7b69, type: 3}
    - {fileID: 21300000, guid: d1e919a001aca4a75bd09e123e55e013, type: 3}
    - {fileID: 21300000, guid: 5998c3ab5a9d248199a52c8f0c167a95, type: 3}
    - {fileID: 21300000, guid: 8a3651c39a0c147c49d13c3e101acdb6, type: 3}
    - {fileID: 21300000, guid: 63a77336a7dc443eabd4a18a4a48a9d6, type: 3}
    - {fileID: 21300000, guid: 93b2fe455a7a243f1a735052bca2f1e6, type: 3}
    - {fileID: 21300000, guid: e7baa900014fb41bfa70bdc592d21be1, type: 3}
    - {fileID: 21300000, guid: 20ab1a45a9cf04886860c00afee2a17a, type: 3}
    - {fileID: 21300000, guid: 5d955e29b84524388ba44a907a5d920d, type: 3}
    - {fileID: 21300000, guid: 520eee391007b4b32bc7964a9a452a6c, type: 3}
    - {fileID: 21300000, guid: e998c68c1e53b4ac3bbf5053184d07d5, type: 3}
    - {fileID: 21300000, guid: 95b9112e8a94d49e5850c561506b5e0e, type: 3}
    - {fileID: 21300000, guid: 40698bc941f3b42768472c039d4148f0, type: 3}
    - {fileID: 21300000, guid: 37e341782896841d0b3dc2a4f5ca0a2c, type: 3}
    - {fileID: 21300000, guid: 8d46b19f1ce874e5eac051d445a79b2a, type: 3}
    - {fileID: 21300000, guid: 88cce49c709e84a1abe85e23006c094b, type: 3}
    - {fileID: 21300000, guid: 28d1f050190314c77be0dc63a45e655e, type: 3}
    - {fileID: 21300000, guid: 75322fa0a09e145fb8f45fdc654d255e, type: 3}
    - {fileID: 21300000, guid: 123116b977c4d4575a64086a1cb94c3f, type: 3}
    - {fileID: 21300000, guid: 302cd23a799d744e89ff50cd2984fd79, type: 3}
    - {fileID: 21300000, guid: a75b44b5c2d5e4619ab88951485ea1af, type: 3}
    - {fileID: 21300000, guid: 956963cb57ae942f590ff8908ee7ba8f, type: 3}
    - {fileID: 21300000, guid: 210e7a7b3e71b42a2aeb369971fbb331, type: 3}
    - {fileID: 21300000, guid: 2fcebf2fec6334255a1d064c13abad9c, type: 3}
    - {fileID: 21300000, guid: d004bf4de32ed4290ac35cb48aa915ab, type: 3}
    - {fileID: 21300000, guid: 7333c1862093d4f4bbcf690098a389d5, type: 3}
    - {fileID: 21300000, guid: cea7e8fe2f47e44c89c6bcc9327810ef, type: 3}
    - {fileID: 21300000, guid: 0d3cb7abf804c44b69efd9c7fb1fc72e, type: 3}
    - {fileID: 21300000, guid: 0ffed9d114ee443a79658065ad4573f1, type: 3}
    - {fileID: 21300000, guid: 9c51a415b47224210a9381f1ef8002aa, type: 3}
    - {fileID: 21300000, guid: e48676433b5ec4b509928be4e2009004, type: 3}
    - {fileID: 21300000, guid: c1e5c3978b205408a9ffc125ca4d4d51, type: 3}
    - {fileID: 21300000, guid: 4b42ed0be9d1e407d9b7fd49ecde6a67, type: 3}
    - {fileID: 21300000, guid: 5dd040de9848246aaaf70cf3278540bb, type: 3}
    - {fileID: 21300000, guid: b029146194f334bb4814c3257113fad4, type: 3}
    - {fileID: 21300000, guid: 186a47642b63e4a9f87a124793c7aa3b, type: 3}
    - {fileID: 21300000, guid: 808ca0364849c46b39a18f1a798fa6c4, type: 3}
    - {fileID: 21300000, guid: d4380d1bfe1954b8ea0a5bb3cc48a4d4, type: 3}
    - {fileID: 21300000, guid: 9e4327576a1064cb9942c9833c13029f, type: 3}
    - {fileID: 21300000, guid: 2c2ba20500e4447c9b046339c5393f8b, type: 3}
    - {fileID: 21300000, guid: eb5495b1e9ead420db4df666ddc7b860, type: 3}
    - {fileID: 21300000, guid: ded5795570ff64733ab4702ca0468fb3, type: 3}
    - {fileID: 21300000, guid: 919ced67f320449bb84df7ed754396ac, type: 3}
    - {fileID: 21300000, guid: 709c47606e441459bae2ff87fa339654, type: 3}
    - {fileID: 21300000, guid: 12d43bc4ffeb646fd8a745fafa323225, type: 3}
    - {fileID: 21300000, guid: 72f46d2fc0527451596337d3f6812c12, type: 3}
    - {fileID: 21300000, guid: 5e8b21be2c8e84981a277bdaedf85e2b, type: 3}
    - {fileID: 21300000, guid: 67dc67b9879994ddb8a9c3d354d21c6a, type: 3}
    - {fileID: 21300000, guid: bc04f0d5fa3d4446baaeeba7fccbf95d, type: 3}
    - {fileID: 21300000, guid: 23fd0fd9cffef4e47b36d1fcae2ba8d9, type: 3}
    - {fileID: 21300000, guid: 27f02b27f567244489af4221b362e808, type: 3}
    - {fileID: 21300000, guid: e858030072ddf4eaa8d0822600ce4c14, type: 3}
    - {fileID: 21300000, guid: 13f85e89887f64c2387a8c2ddc337acc, type: 3}
    - {fileID: 21300000, guid: 4a17089b17b48402cb835b04654cd77c, type: 3}
    - {fileID: 21300000, guid: 7803922c8ecc74890bb19a9eeff0a0da, type: 3}
    - {fileID: 21300000, guid: 19ea10061fe0d42379c809c0cb28517c, type: 3}
    - {fileID: 21300000, guid: 4d765be87c80b4a0398965977da0cfe8, type: 3}
    - {fileID: 21300000, guid: 9ec9b19e9d9084e75aebfc8f054b15c7, type: 3}
    - {fileID: 21300000, guid: 92267aa0a3546477f9e28addfffa24de, type: 3}
    - {fileID: 21300000, guid: 042a65ed42416449daae59ace03a2fc1, type: 3}
    - {fileID: 21300000, guid: d62ac6b9c0aa643c59fd23372429b699, type: 3}
    - {fileID: 21300000, guid: 21912e7bb938c4feb91db71e341e9eb5, type: 3}
    - {fileID: 21300000, guid: 6820e9bf342514d069b606ee0ea327f4, type: 3}
    - {fileID: 21300000, guid: b56e2c50f2b344037903ba959eb37928, type: 3}
    - {fileID: 21300000, guid: 980571e7215e540d39a8d715d1e73a66, type: 3}
    - {fileID: 21300000, guid: 9f008c771ac504a9d8fbd86612d2d771, type: 3}
    - {fileID: 21300000, guid: 5e1bf018ab190435c9b454475f58579d, type: 3}
    - {fileID: 21300000, guid: 7c26c98f8903f420597ad8702b335e55, type: 3}
    - {fileID: 21300000, guid: 72e00b9c28d48477cbbd8e5287c408ce, type: 3}
    - {fileID: 21300000, guid: 83ef58a697fc04e3ea02d54ef764d11c, type: 3}
    - {fileID: 21300000, guid: e87c6bef5999444d1879740e2085395b, type: 3}
    - {fileID: 21300000, guid: 6ec66e346d3b8467b926277759e80f8d, type: 3}
    - {fileID: 21300000, guid: f66ef816f6d624e7aa50126862ca26f1, type: 3}
    - {fileID: 21300000, guid: ff97a6ede1071469898dea929e21f204, type: 3}
    - {fileID: 21300000, guid: 64550997af8fb4527b8c0207aa16a424, type: 3}
    - {fileID: 21300000, guid: 3c9430d3ebabe435facb036b7084ddcc, type: 3}
    - {fileID: 21300000, guid: b82ceeeab15eb4fe09f69c6d231b1f11, type: 3}
    - {fileID: 21300000, guid: 799ff43a60648431b8a6ed63f33a2729, type: 3}
    - {fileID: 21300000, guid: 30cba1d8d5266413db3a1d6e62d0d298, type: 3}
    - {fileID: 21300000, guid: 54d5f6079d6a440e8b4b488b420543f7, type: 3}
    - {fileID: 21300000, guid: 0a0653639c16140a5b63f94d68f0b8e4, type: 3}
    - {fileID: 21300000, guid: 08c3ba2e930744061a94e60413689f38, type: 3}
    - {fileID: 21300000, guid: 4f8c1965b287343e6b68c98d048ddda4, type: 3}
    - {fileID: 21300000, guid: 82cd853cc43d147b8abe8335fb798941, type: 3}
    - {fileID: 21300000, guid: 7266767f379d947b9b9ce4dcadcd064a, type: 3}
    - {fileID: 21300000, guid: 5c081583a82d445f1ad593beb6ce1560, type: 3}
    - {fileID: 21300000, guid: 12df52c5f07cc4ac488c39dfc8c634dd, type: 3}
    - {fileID: 21300000, guid: 6b398b5a5b54c46758d8f16016ac4bb5, type: 3}
    - {fileID: 21300000, guid: 2e03e1d6770e441b3ac7027fb89a4827, type: 3}
    - {fileID: 21300000, guid: 59b77cd5b114842c7934b095aa7dfcf2, type: 3}
    - {fileID: 21300000, guid: e31c90358acda44e28f77e51c6b91b57, type: 3}
    - {fileID: 21300000, guid: 5d9f5d4df4b3b42bdbdcd21e6864a641, type: 3}
    - {fileID: 21300000, guid: 0656ff1ae6cfa4535b371f8dd15c97fd, type: 3}
    - {fileID: 21300000, guid: 5465d3de35cea4217bfe5908914a5507, type: 3}
    - {fileID: 21300000, guid: cef8ae8f952a449cfbc4b61fc225567c, type: 3}
    - {fileID: 21300000, guid: 40f5d9e1a73b84d4b9f7454c7a1cede8, type: 3}
    - {fileID: 21300000, guid: 0fece70ddd5cc4838995873a5ddae59f, type: 3}
    - {fileID: 21300000, guid: 1742bc07bc7674e50aa163648f4514a9, type: 3}
    - {fileID: 21300000, guid: 3364fd379c2e5468a93c3072f9e0339d, type: 3}
    - {fileID: 21300000, guid: d5815a00808854167a6fed9bcf1b1f5f, type: 3}
    - {fileID: 21300000, guid: e69833f13407f4322af631df8d2df4fa, type: 3}
    - {fileID: 21300000, guid: e0996d7aa9e7242fb91c9f4b614dba61, type: 3}
    - {fileID: 21300000, guid: 696591f640a6b4b92bf092e66390ed2d, type: 3}
    - {fileID: 21300000, guid: a3010bbf881444f9b877a8a3b368c4fe, type: 3}
    - {fileID: 21300000, guid: 0672ae75fa4fd47048527c083a12d91e, type: 3}
    - {fileID: 21300000, guid: 9c6660b94a4574d35a055952c0c856ed, type: 3}
    - {fileID: 21300000, guid: f622628dafe0c4366b9b9c2a7c27f3ac, type: 3}
    - {fileID: 21300000, guid: 482e2c9ce6cb947ab8928e87b81d71d7, type: 3}
    - {fileID: 21300000, guid: 4139b7c02872e422e92d8c313a797246, type: 3}
    - {fileID: 21300000, guid: 4b9396f1277c14e30b66198963d665f1, type: 3}
    - {fileID: 21300000, guid: e9e28a45876404e5dabc1ad6cf3f6012, type: 3}
    - {fileID: 21300000, guid: bc88c8a565d394edaa9eb42c2d66c933, type: 3}
    - {fileID: 21300000, guid: ccc05782c280b44b08ddc33223677379, type: 3}
    - {fileID: 21300000, guid: a0f62fae25e4141e194cdc943d62801f, type: 3}
    - {fileID: 21300000, guid: 53644106f39bf4181aed117d452fc39e, type: 3}
    - {fileID: 21300000, guid: 37b120af6b5124667be1f8df50064c9b, type: 3}
    - {fileID: 21300000, guid: 65446ca6a6faa400988be02dce02ecfc, type: 3}
    - {fileID: 21300000, guid: 14d3ea56324074cddaec70e5e7f1575a, type: 3}
    - {fileID: 21300000, guid: 62c6e6ea8a0b0445ab4b089a6c5c8e9f, type: 3}
    - {fileID: 21300000, guid: 9d80a84692b67402a917c226f9b38824, type: 3}
    - {fileID: 21300000, guid: de44b2f593cb34743b9c77b4a454ec5a, type: 3}
    - {fileID: 21300000, guid: 6f935b3fca172468e96536427fe09e86, type: 3}
    - {fileID: 21300000, guid: 0f4a42f167fcc4979896915d64fbd8ae, type: 3}
    - {fileID: 21300000, guid: d725f3f0edb6d429da4a401b74b63afb, type: 3}
    - {fileID: 21300000, guid: 83d7e8c2567414230be310a1d8382885, type: 3}
    - {fileID: 21300000, guid: ea357d8e6f4974388b30b583f205ecff, type: 3}
  m_AnimationClipSettings:
    serializedVersion: 2
    m_AdditiveReferencePoseClip: {fileID: 0}
    m_AdditiveReferencePoseTime: 0
    m_StartTime: 0
    m_StopTime: 4.1833334
    m_OrientationOffsetY: 0
    m_Level: 0
    m_CycleOffset: 0
    m_HasAdditiveReferencePose: 0
    m_LoopTime: 1
    m_LoopBlend: 0
    m_LoopBlendOrientation: 0
    m_LoopBlendPositionY: 0
    m_LoopBlendPositionXZ: 0
    m_KeepOriginalOrientation: 0
    m_KeepOriginalPositionY: 1
    m_KeepOriginalPositionXZ: 0
    m_HeightFromFeet: 0
    m_Mirror: 0
  m_EditorCurves: []
  m_EulerEditorCurves: []
  m_HasGenericRootTransform: 0
  m_HasMotionFloatCurves: 0
  m_Events: []
