{"type":"root","options":{

},"size":{"width":1544,"height":396},"children":[{"name":"SCREEN 24","type":"group","options":{

},"offset":{"left":132,"top":65},"size":{"width":184,"height":301},"relativePath":"SCREEN 24","children":[{"name":"Icon","type":"png","options":{

},"offset":{"left":132,"top":65},"size":{"width":184,"height":126},"relativePath":"SCREEN 24/Icon","children":[

]},{"name":"OK","type":"text","options":{"opacity":100,"textContents":"OK","textFont":"AkkuratBoldBold","textSize":29,"textColor":{"red":255,"green":255,"blue":255},"textHorizontalWrap":false},"offset":{"left":197,"top":343},"size":{"width":39,"height":23},"relativePath":"SCREEN 24/OK","children":[

]},{"name":"Shape1","type":"png","options":{

},"offset":{"left":0,"top":323},"size":{"width":433,"height":63},"relativePath":"SCREEN 24/Shape1","children":[

]},{"name":"OK","type":"text","options":{"opacity":100,"textContents":"OK","textFont":"AkkuratBoldBold","textSize":29,"textColor":{"red":0,"green":0,"blue":0},"textHorizontalWrap":false},"offset":{"left":1308,"top":343},"size":{"width":39,"height":23},"relativePath":"SCREEN 24/OK (2)","children":[

]},{"name":"Shape2","type":"png","options":{

},"offset":{"left":1111,"top":323},"size":{"width":433,"height":63},"relativePath":"SCREEN 24/Shape2","children":[

]},{"name":"Shape3","type":"png","options":{

},"offset":{"left":499,"top":0},"size":{"width":456,"height":396},"relativePath":"SCREEN 24/Shape3","children":[

]}]}]}
