{"type":"root","options":{

},"size":{"width":1265,"height":636},"children":[{"name":"Screen 05","type":"group","options":{

},"offset":{"left":717,"top":348},"size":{"width":548,"height":288},"relativePath":"Screen 05","children":[{"name":"Shape1","type":"png","options":{

},"offset":{"left":819,"top":572},"size":{"width":73,"height":64},"relativePath":"Screen 05/Shape1","children":[

]},{"name":"Shape2","type":"png","options":{

},"offset":{"left":717,"top":569},"size":{"width":73,"height":64},"relativePath":"Screen 05/Shape2","children":[

]},{"name":"Shape3","type":"png","options":{

},"offset":{"left":833,"top":457},"size":{"width":105,"height":92},"relativePath":"Screen 05/Shape3","children":[

]},{"name":"Shape5","type":"png","options":{

},"offset":{"left":1160,"top":457},"size":{"width":105,"height":92},"relativePath":"Screen 05/Shape5","children":[

]},{"name":"Shape6","type":"png","options":{

},"offset":{"left":1160,"top":348},"size":{"width":105,"height":91},"relativePath":"Screen 05/Shape6","children":[

]},{"name":"Shape7","type":"png","options":{

},"offset":{"left":1096,"top":416},"size":{"width":74,"height":64},"relativePath":"Screen 05/Shape7","children":[

]},{"name":"Shape8","type":"png","options":{

},"offset":{"left":833,"top":348},"size":{"width":105,"height":91},"relativePath":"Screen 05/Shape8","children":[

]},{"name":"Shape9","type":"png","options":{

},"offset":{"left":770,"top":416},"size":{"width":73,"height":64},"relativePath":"Screen 05/Shape9","children":[

]},{"name":"Shape10","type":"png","options":{

},"offset":{"left":295,"top":0},"size":{"width":111,"height":111},"relativePath":"Screen 05/Shape10","children":[

]},{"name":"Shape11","type":"png","options":{

},"offset":{"left":144,"top":0},"size":{"width":110,"height":111},"relativePath":"Screen 05/Shape11","children":[

]},{"name":"Shape12","type":"png","options":{

},"offset":{"left":0,"top":0},"size":{"width":111,"height":111},"relativePath":"Screen 05/Shape12","children":[

]},{"name":"END SELECTION","type":"text","options":{"opacity":100,"textContents":"END\rSELECTION","textFont":"AkkuratBoldBold","textSize":19,"textColor":{"red":255,"green":255,"blue":255},"textHorizontalWrap":false},"offset":{"left":956,"top":482},"size":{"width":105,"height":40},"relativePath":"Screen 05/END SELECTION","children":[

]},{"name":"START SELECTION","type":"text","options":{"opacity":100,"textContents":"START\rSELECTION","textFont":"AkkuratBoldBold","textSize":19,"textColor":{"red":255,"green":255,"blue":255},"textHorizontalWrap":false},"offset":{"left":956,"top":373},"size":{"width":105,"height":40},"relativePath":"Screen 05/START SELECTION","children":[

]}]}]}
