{"type":"root","options":{

},"size":{"width":728,"height":51},"children":[{"name":"Screen 37","type":"group","options":{

},"offset":{"left":52,"top":3},"size":{"width":675,"height":43},"relativePath":"Screen 37","children":[{"name":"ENGINEER 1","type":"text","options":{"opacity":100,"textContents":"ENGINEER 1","textFont":"AkkuratBoldBold","textSize":24,"textColor":{"red":166,"green":166,"blue":166},"textHorizontalWrap":false},"offset":{"left":52,"top":3},"size":{"width":134,"height":19},"relativePath":"Screen 37/ENGINEER 1","children":[

]},{"name":"MAINTENENCE ENG","type":"text","options":{"opacity":100,"textContents":"MAINTENENCE ENG","textFont":"AkkuratBoldBold","textSize":18,"textColor":{"red":255,"green":255,"blue":255},"textHorizontalWrap":false},"offset":{"left":559,"top":32},"size":{"width":168,"height":14},"relativePath":"Screen 37/MAINTENENCE ENG","children":[

]},{"name":"ENGINEER 1","type":"text","options":{"opacity":100,"textContents":"ENGINEER 1","textFont":"AkkuratBoldBold","textSize":24,"textColor":{"red":255,"green":255,"blue":255},"textHorizontalWrap":false},"offset":{"left":560,"top":3},"size":{"width":134,"height":19},"relativePath":"Screen 37/ENGINEER 1 (2)","children":[

]},{"name":"Icon1","type":"png","options":{

},"offset":{"left":508,"top":3},"size":{"width":31,"height":43},"relativePath":"Screen 37/Icon1","children":[

]},{"name":"Icon2","type":"png","options":{

},"offset":{"left":0,"top":3},"size":{"width":31,"height":43},"relativePath":"Screen 37/Icon2","children":[

]}]}]}
