{"type":"root","options":{

},"size":{"width":475,"height":182},"children":[{"name":"Screen 33","type":"group","options":{

},"offset":{"left":380,"top":100},"size":{"width":95,"height":82},"relativePath":"Screen 33","children":[{"name":"Icon1","type":"png","options":{

},"offset":{"left":380,"top":100},"size":{"width":95,"height":82},"relativePath":"Screen 33/Icon1","children":[

]},{"name":"Icon2","type":"png","options":{

},"offset":{"left":380,"top":0},"size":{"width":95,"height":83},"relativePath":"Screen 33/Icon2","children":[

]},{"name":"Icon3","type":"png","options":{

},"offset":{"left":322,"top":63},"size":{"width":67,"height":57},"relativePath":"Screen 33/Icon3","children":[

]},{"name":"Icon4","type":"png","options":{

},"offset":{"left":58,"top":100},"size":{"width":95,"height":82},"relativePath":"Screen 33/Icon4","children":[

]},{"name":"Icon5","type":"png","options":{

},"offset":{"left":58,"top":0},"size":{"width":95,"height":83},"relativePath":"Screen 33/Icon5","children":[

]},{"name":"Icon6","type":"png","options":{

},"offset":{"left":0,"top":63},"size":{"width":67,"height":57},"relativePath":"Screen 33/Icon6","children":[

]},{"name":"ZOOM OUT","type":"text","options":{"opacity":100,"textContents":"ZOOM OUT","textFont":"AkkuratBoldBold","textSize":18,"textColor":{"red":255,"green":255,"blue":255},"textHorizontalWrap":false},"offset":{"left":169,"top":129},"size":{"width":90,"height":14},"relativePath":"Screen 33/ZOOM OUT","children":[

]},{"name":"ZOOM IN","type":"text","options":{"opacity":100,"textContents":"ZOOM IN","textFont":"AkkuratBoldBold","textSize":18,"textColor":{"red":255,"green":255,"blue":255},"textHorizontalWrap":false},"offset":{"left":169,"top":35},"size":{"width":72,"height":14},"relativePath":"Screen 33/ZOOM IN","children":[

]}]}]}
