<?xml version="1.0" encoding="UTF-8"?>
<testsuite xmlns:xsi="http://www.w3.org/2001/XMLSchema-instance" xsi:noNamespaceSchemaLocation="https://maven.apache.org/surefire/maven-surefire-plugin/xsd/surefire-test-report-3.0.xsd" version="3.0" name="com.webstaurantstore_cucumber_page_factory.runner.WebstaurantstoreTest" time="49.571" tests="4" errors="0" skipped="0" failures="0">
  <properties>
    <property name="java.specification.version" value="22"/>
    <property name="sun.jnu.encoding" value="UTF-8"/>
    <property name="java.class.path" value="/Users/joel_arias/Documents/Coding/Testing/Front_End/Java/Cucumber/Practice/webstaurantstore_cucumber_page_factory/target/test-classes:/Users/joel_arias/Documents/Coding/Testing/Front_End/Java/Cucumber/Practice/webstaurantstore_cucumber_page_factory/target/classes:/Users/joel_arias/.m2/repository/ru/stqa/selenium/webdriver-factory/4.3/webdriver-factory-4.3.jar:/Users/joel_arias/.m2/repository/org/hamcrest/java-hamcrest/2.0.0.0/java-hamcrest-2.0.0.0.jar:/Users/joel_arias/.m2/repository/org/seleniumhq/selenium/selenium-java/4.25.0/selenium-java-4.25.0.jar:/Users/joel_arias/.m2/repository/org/seleniumhq/selenium/selenium-api/4.25.0/selenium-api-4.25.0.jar:/Users/joel_arias/.m2/repository/org/jspecify/jspecify/1.0.0/jspecify-1.0.0.jar:/Users/joel_arias/.m2/repository/org/seleniumhq/selenium/selenium-chrome-driver/4.25.0/selenium-chrome-driver-4.25.0.jar:/Users/joel_arias/.m2/repository/org/seleniumhq/selenium/selenium-chromium-driver/4.25.0/selenium-chromium-driver-4.25.0.jar:/Users/joel_arias/.m2/repository/org/seleniumhq/selenium/selenium-devtools-v127/4.25.0/selenium-devtools-v127-4.25.0.jar:/Users/joel_arias/.m2/repository/org/seleniumhq/selenium/selenium-devtools-v128/4.25.0/selenium-devtools-v128-4.25.0.jar:/Users/joel_arias/.m2/repository/org/seleniumhq/selenium/selenium-devtools-v129/4.25.0/selenium-devtools-v129-4.25.0.jar:/Users/joel_arias/.m2/repository/org/seleniumhq/selenium/selenium-devtools-v85/4.25.0/selenium-devtools-v85-4.25.0.jar:/Users/joel_arias/.m2/repository/org/seleniumhq/selenium/selenium-edge-driver/4.25.0/selenium-edge-driver-4.25.0.jar:/Users/joel_arias/.m2/repository/org/seleniumhq/selenium/selenium-firefox-driver/4.25.0/selenium-firefox-driver-4.25.0.jar:/Users/joel_arias/.m2/repository/org/seleniumhq/selenium/selenium-ie-driver/4.25.0/selenium-ie-driver-4.25.0.jar:/Users/joel_arias/.m2/repository/org/seleniumhq/selenium/selenium-safari-driver/4.25.0/selenium-safari-driver-4.25.0.jar:/Users/joel_arias/.m2/repository/org/seleniumhq/selenium/selenium-support/4.25.0/selenium-support-4.25.0.jar:/Users/joel_arias/.m2/repository/org/seleniumhq/selenium/selenium-remote-driver/4.25.0/selenium-remote-driver-4.25.0.jar:/Users/joel_arias/.m2/repository/com/google/auto/service/auto-service-annotations/1.1.1/auto-service-annotations-1.1.1.jar:/Users/joel_arias/.m2/repository/com/google/guava/guava/33.3.0-jre/guava-33.3.0-jre.jar:/Users/joel_arias/.m2/repository/com/google/guava/failureaccess/1.0.2/failureaccess-1.0.2.jar:/Users/joel_arias/.m2/repository/com/google/guava/listenablefuture/9999.0-empty-to-avoid-conflict-with-guava/listenablefuture-9999.0-empty-to-avoid-conflict-with-guava.jar:/Users/joel_arias/.m2/repository/com/google/code/findbugs/jsr305/3.0.2/jsr305-3.0.2.jar:/Users/joel_arias/.m2/repository/org/checkerframework/checker-qual/3.43.0/checker-qual-3.43.0.jar:/Users/joel_arias/.m2/repository/com/google/errorprone/error_prone_annotations/2.28.0/error_prone_annotations-2.28.0.jar:/Users/joel_arias/.m2/repository/com/google/j2objc/j2objc-annotations/3.0.0/j2objc-annotations-3.0.0.jar:/Users/joel_arias/.m2/repository/io/opentelemetry/semconv/opentelemetry-semconv/1.25.0-alpha/opentelemetry-semconv-1.25.0-alpha.jar:/Users/joel_arias/.m2/repository/io/opentelemetry/opentelemetry-api/1.42.1/opentelemetry-api-1.42.1.jar:/Users/joel_arias/.m2/repository/io/opentelemetry/opentelemetry-context/1.42.1/opentelemetry-context-1.42.1.jar:/Users/joel_arias/.m2/repository/io/opentelemetry/opentelemetry-exporter-logging/1.42.1/opentelemetry-exporter-logging-1.42.1.jar:/Users/joel_arias/.m2/repository/io/opentelemetry/opentelemetry-sdk-common/1.42.1/opentelemetry-sdk-common-1.42.1.jar:/Users/joel_arias/.m2/repository/io/opentelemetry/opentelemetry-sdk-extension-autoconfigure-spi/1.42.1/opentelemetry-sdk-extension-autoconfigure-spi-1.42.1.jar:/Users/joel_arias/.m2/repository/io/opentelemetry/opentelemetry-sdk-extension-autoconfigure/1.42.1/opentelemetry-sdk-extension-autoconfigure-1.42.1.jar:/Users/joel_arias/.m2/repository/io/opentelemetry/opentelemetry-api-incubator/1.42.1-alpha/opentelemetry-api-incubator-1.42.1-alpha.jar:/Users/joel_arias/.m2/repository/io/opentelemetry/opentelemetry-sdk-trace/1.42.1/opentelemetry-sdk-trace-1.42.1.jar:/Users/joel_arias/.m2/repository/io/opentelemetry/opentelemetry-sdk/1.42.1/opentelemetry-sdk-1.42.1.jar:/Users/joel_arias/.m2/repository/io/opentelemetry/opentelemetry-sdk-metrics/1.42.1/opentelemetry-sdk-metrics-1.42.1.jar:/Users/joel_arias/.m2/repository/io/opentelemetry/opentelemetry-sdk-logs/1.42.1/opentelemetry-sdk-logs-1.42.1.jar:/Users/joel_arias/.m2/repository/net/bytebuddy/byte-buddy/1.15.1/byte-buddy-1.15.1.jar:/Users/joel_arias/.m2/repository/org/seleniumhq/selenium/selenium-http/4.25.0/selenium-http-4.25.0.jar:/Users/joel_arias/.m2/repository/dev/failsafe/failsafe/3.3.2/failsafe-3.3.2.jar:/Users/joel_arias/.m2/repository/org/seleniumhq/selenium/selenium-json/4.25.0/selenium-json-4.25.0.jar:/Users/joel_arias/.m2/repository/org/seleniumhq/selenium/selenium-manager/4.25.0/selenium-manager-4.25.0.jar:/Users/joel_arias/.m2/repository/org/seleniumhq/selenium/selenium-os/4.25.0/selenium-os-4.25.0.jar:/Users/joel_arias/.m2/repository/org/apache/commons/commons-exec/1.4.0/commons-exec-1.4.0.jar:/Users/joel_arias/.m2/repository/commons-io/commons-io/2.15.1/commons-io-2.15.1.jar:/Users/joel_arias/.m2/repository/io/github/bonigarcia/webdrivermanager/5.6.4/webdrivermanager-5.6.4.jar:/Users/joel_arias/.m2/repository/com/google/code/gson/gson/2.10.1/gson-2.10.1.jar:/Users/joel_arias/.m2/repository/com/github/docker-java/docker-java/3.3.4/docker-java-3.3.4.jar:/Users/joel_arias/.m2/repository/com/github/docker-java/docker-java-core/3.3.4/docker-java-core-3.3.4.jar:/Users/joel_arias/.m2/repository/com/github/docker-java/docker-java-api/3.3.4/docker-java-api-3.3.4.jar:/Users/joel_arias/.m2/repository/org/bouncycastle/bcpkix-jdk18on/1.76/bcpkix-jdk18on-1.76.jar:/Users/joel_arias/.m2/repository/org/bouncycastle/bcprov-jdk18on/1.76/bcprov-jdk18on-1.76.jar:/Users/joel_arias/.m2/repository/org/bouncycastle/bcutil-jdk18on/1.76/bcutil-jdk18on-1.76.jar:/Users/joel_arias/.m2/repository/com/github/docker-java/docker-java-transport-httpclient5/3.3.4/docker-java-transport-httpclient5-3.3.4.jar:/Users/joel_arias/.m2/repository/com/github/docker-java/docker-java-transport/3.3.4/docker-java-transport-3.3.4.jar:/Users/joel_arias/.m2/repository/net/java/dev/jna/jna/5.13.0/jna-5.13.0.jar:/Users/joel_arias/.m2/repository/org/brotli/dec/0.1.2/dec-0.1.2.jar:/Users/joel_arias/.m2/repository/org/apache/commons/commons-lang3/3.14.0/commons-lang3-3.14.0.jar:/Users/joel_arias/.m2/repository/org/apache/commons/commons-compress/1.26.0/commons-compress-1.26.0.jar:/Users/joel_arias/.m2/repository/org/apache/httpcomponents/client5/httpclient5/5.2.1/httpclient5-5.2.1.jar:/Users/joel_arias/.m2/repository/org/apache/httpcomponents/core5/httpcore5/5.2/httpcore5-5.2.jar:/Users/joel_arias/.m2/repository/org/apache/httpcomponents/core5/httpcore5-h2/5.2/httpcore5-h2-5.2.jar:/Users/joel_arias/.m2/repository/io/cucumber/cucumber-junit/7.17.0/cucumber-junit-7.17.0.jar:/Users/joel_arias/.m2/repository/org/apiguardian/apiguardian-api/1.1.2/apiguardian-api-1.1.2.jar:/Users/joel_arias/.m2/repository/io/cucumber/cucumber-core/7.17.0/cucumber-core-7.17.0.jar:/Users/joel_arias/.m2/repository/io/cucumber/cucumber-gherkin/7.17.0/cucumber-gherkin-7.17.0.jar:/Users/joel_arias/.m2/repository/io/cucumber/cucumber-gherkin-messages/7.17.0/cucumber-gherkin-messages-7.17.0.jar:/Users/joel_arias/.m2/repository/io/cucumber/gherkin/28.0.0/gherkin-28.0.0.jar:/Users/joel_arias/.m2/repository/io/cucumber/messages/24.1.0/messages-24.1.0.jar:/Users/joel_arias/.m2/repository/io/cucumber/testng-xml-formatter/0.1.0/testng-xml-formatter-0.1.0.jar:/Users/joel_arias/.m2/repository/io/cucumber/query/12.2.0/query-12.2.0.jar:/Users/joel_arias/.m2/repository/io/cucumber/tag-expressions/6.1.0/tag-expressions-6.1.0.jar:/Users/joel_arias/.m2/repository/io/cucumber/cucumber-expressions/17.1.0/cucumber-expressions-17.1.0.jar:/Users/joel_arias/.m2/repository/io/cucumber/datatable/7.17.0/datatable-7.17.0.jar:/Users/joel_arias/.m2/repository/io/cucumber/cucumber-plugin/7.17.0/cucumber-plugin-7.17.0.jar:/Users/joel_arias/.m2/repository/io/cucumber/docstring/7.17.0/docstring-7.17.0.jar:/Users/joel_arias/.m2/repository/io/cucumber/html-formatter/21.3.1/html-formatter-21.3.1.jar:/Users/joel_arias/.m2/repository/io/cucumber/junit-xml-formatter/0.4.0/junit-xml-formatter-0.4.0.jar:/Users/joel_arias/.m2/repository/io/cucumber/ci-environment/10.0.1/ci-environment-10.0.1.jar:/Users/joel_arias/.m2/repository/junit/junit/4.13.2/junit-4.13.2.jar:/Users/joel_arias/.m2/repository/org/hamcrest/hamcrest-core/1.3/hamcrest-core-1.3.jar:/Users/joel_arias/.m2/repository/io/cucumber/cucumber-java/7.17.0/cucumber-java-7.17.0.jar:/Users/joel_arias/.m2/repository/org/opentest4j/opentest4j/1.3.0/opentest4j-1.3.0.jar:/Users/joel_arias/.m2/repository/net/masterthought/cucumber-reporting/5.8.2/cucumber-reporting-5.8.2.jar:/Users/joel_arias/.m2/repository/com/fasterxml/jackson/core/jackson-databind/2.17.0/jackson-databind-2.17.0.jar:/Users/joel_arias/.m2/repository/com/fasterxml/jackson/core/jackson-annotations/2.17.0/jackson-annotations-2.17.0.jar:/Users/joel_arias/.m2/repository/com/fasterxml/jackson/core/jackson-core/2.17.0/jackson-core-2.17.0.jar:/Users/joel_arias/.m2/repository/com/fasterxml/jackson/datatype/jackson-datatype-jsr310/2.17.0/jackson-datatype-jsr310-2.17.0.jar:/Users/joel_arias/.m2/repository/org/apache/velocity/velocity-engine-core/2.3/velocity-engine-core-2.3.jar:/Users/joel_arias/.m2/repository/joda-time/joda-time/2.12.7/joda-time-2.12.7.jar:/Users/joel_arias/.m2/repository/org/apache/commons/commons-configuration2/2.10.1/commons-configuration2-2.10.1.jar:/Users/joel_arias/.m2/repository/org/apache/commons/commons-text/1.11.0/commons-text-1.11.0.jar:/Users/joel_arias/.m2/repository/org/jsoup/jsoup/1.17.2/jsoup-1.17.2.jar:/Users/joel_arias/.m2/repository/com/googlecode/owasp-java-html-sanitizer/owasp-java-html-sanitizer/20240325.1/owasp-java-html-sanitizer-20240325.1.jar:/Users/joel_arias/.m2/repository/com/googlecode/owasp-java-html-sanitizer/java8-shim/20240325.1/java8-shim-20240325.1.jar:/Users/joel_arias/.m2/repository/com/googlecode/owasp-java-html-sanitizer/java10-shim/20240325.1/java10-shim-20240325.1.jar:/Users/joel_arias/.m2/repository/org/slf4j/jcl-over-slf4j/2.0.13/jcl-over-slf4j-2.0.13.jar:/Users/joel_arias/.m2/repository/org/slf4j/slf4j-api/2.0.16/slf4j-api-2.0.16.jar:/Users/joel_arias/.m2/repository/org/slf4j/slf4j-reload4j/2.0.16/slf4j-reload4j-2.0.16.jar:/Users/joel_arias/.m2/repository/ch/qos/reload4j/reload4j/1.2.22/reload4j-1.2.22.jar:/Users/joel_arias/.m2/repository/log4j/log4j/1.2.17/log4j-1.2.17.jar:/Users/joel_arias/.m2/repository/org/apache/logging/log4j/log4j-api/2.8.2/log4j-api-2.8.2.jar:/Users/joel_arias/.m2/repository/org/apache/logging/log4j/log4j-core/2.17.2/log4j-core-2.17.2.jar:"/>
    <property name="java.vm.vendor" value="Homebrew"/>
    <property name="sun.arch.data.model" value="64"/>
    <property name="java.vendor.url" value="https://github.com/Homebrew/homebrew-core/issues"/>
    <property name="browserName" value="chrome"/>
    <property name="os.name" value="Mac OS X"/>
    <property name="java.vm.specification.version" value="22"/>
    <property name="sun.java.launcher" value="SUN_STANDARD"/>
    <property name="user.country" value="MX"/>
    <property name="sun.boot.library.path" value="/opt/homebrew/Cellar/openjdk/22.0.2/libexec/openjdk.jdk/Contents/Home/lib"/>
    <property name="sun.java.command" value="/Users/joel_arias/Documents/Coding/Testing/Front_End/Java/Cucumber/Practice/webstaurantstore_cucumber_page_factory/target/surefire/surefirebooter-20241020162020402_3.jar /Users/joel_arias/Documents/Coding/Testing/Front_End/Java/Cucumber/Practice/webstaurantstore_cucumber_page_factory/target/surefire 2024-10-20T16-20-20_350-jvmRun1 surefire-20241020162020402_1tmp surefire_0-20241020162020402_2tmp"/>
    <property name="http.nonProxyHosts" value="local|*.local|169.254/16|*.169.254/16"/>
    <property name="jdk.debug" value="release"/>
    <property name="surefire.test.class.path" value="/Users/joel_arias/Documents/Coding/Testing/Front_End/Java/Cucumber/Practice/webstaurantstore_cucumber_page_factory/target/test-classes:/Users/joel_arias/Documents/Coding/Testing/Front_End/Java/Cucumber/Practice/webstaurantstore_cucumber_page_factory/target/classes:/Users/joel_arias/.m2/repository/ru/stqa/selenium/webdriver-factory/4.3/webdriver-factory-4.3.jar:/Users/joel_arias/.m2/repository/org/hamcrest/java-hamcrest/2.0.0.0/java-hamcrest-2.0.0.0.jar:/Users/joel_arias/.m2/repository/org/seleniumhq/selenium/selenium-java/4.25.0/selenium-java-4.25.0.jar:/Users/joel_arias/.m2/repository/org/seleniumhq/selenium/selenium-api/4.25.0/selenium-api-4.25.0.jar:/Users/joel_arias/.m2/repository/org/jspecify/jspecify/1.0.0/jspecify-1.0.0.jar:/Users/joel_arias/.m2/repository/org/seleniumhq/selenium/selenium-chrome-driver/4.25.0/selenium-chrome-driver-4.25.0.jar:/Users/joel_arias/.m2/repository/org/seleniumhq/selenium/selenium-chromium-driver/4.25.0/selenium-chromium-driver-4.25.0.jar:/Users/joel_arias/.m2/repository/org/seleniumhq/selenium/selenium-devtools-v127/4.25.0/selenium-devtools-v127-4.25.0.jar:/Users/joel_arias/.m2/repository/org/seleniumhq/selenium/selenium-devtools-v128/4.25.0/selenium-devtools-v128-4.25.0.jar:/Users/joel_arias/.m2/repository/org/seleniumhq/selenium/selenium-devtools-v129/4.25.0/selenium-devtools-v129-4.25.0.jar:/Users/joel_arias/.m2/repository/org/seleniumhq/selenium/selenium-devtools-v85/4.25.0/selenium-devtools-v85-4.25.0.jar:/Users/joel_arias/.m2/repository/org/seleniumhq/selenium/selenium-edge-driver/4.25.0/selenium-edge-driver-4.25.0.jar:/Users/joel_arias/.m2/repository/org/seleniumhq/selenium/selenium-firefox-driver/4.25.0/selenium-firefox-driver-4.25.0.jar:/Users/joel_arias/.m2/repository/org/seleniumhq/selenium/selenium-ie-driver/4.25.0/selenium-ie-driver-4.25.0.jar:/Users/joel_arias/.m2/repository/org/seleniumhq/selenium/selenium-safari-driver/4.25.0/selenium-safari-driver-4.25.0.jar:/Users/joel_arias/.m2/repository/org/seleniumhq/selenium/selenium-support/4.25.0/selenium-support-4.25.0.jar:/Users/joel_arias/.m2/repository/org/seleniumhq/selenium/selenium-remote-driver/4.25.0/selenium-remote-driver-4.25.0.jar:/Users/joel_arias/.m2/repository/com/google/auto/service/auto-service-annotations/1.1.1/auto-service-annotations-1.1.1.jar:/Users/joel_arias/.m2/repository/com/google/guava/guava/33.3.0-jre/guava-33.3.0-jre.jar:/Users/joel_arias/.m2/repository/com/google/guava/failureaccess/1.0.2/failureaccess-1.0.2.jar:/Users/joel_arias/.m2/repository/com/google/guava/listenablefuture/9999.0-empty-to-avoid-conflict-with-guava/listenablefuture-9999.0-empty-to-avoid-conflict-with-guava.jar:/Users/joel_arias/.m2/repository/com/google/code/findbugs/jsr305/3.0.2/jsr305-3.0.2.jar:/Users/joel_arias/.m2/repository/org/checkerframework/checker-qual/3.43.0/checker-qual-3.43.0.jar:/Users/joel_arias/.m2/repository/com/google/errorprone/error_prone_annotations/2.28.0/error_prone_annotations-2.28.0.jar:/Users/joel_arias/.m2/repository/com/google/j2objc/j2objc-annotations/3.0.0/j2objc-annotations-3.0.0.jar:/Users/joel_arias/.m2/repository/io/opentelemetry/semconv/opentelemetry-semconv/1.25.0-alpha/opentelemetry-semconv-1.25.0-alpha.jar:/Users/joel_arias/.m2/repository/io/opentelemetry/opentelemetry-api/1.42.1/opentelemetry-api-1.42.1.jar:/Users/joel_arias/.m2/repository/io/opentelemetry/opentelemetry-context/1.42.1/opentelemetry-context-1.42.1.jar:/Users/joel_arias/.m2/repository/io/opentelemetry/opentelemetry-exporter-logging/1.42.1/opentelemetry-exporter-logging-1.42.1.jar:/Users/joel_arias/.m2/repository/io/opentelemetry/opentelemetry-sdk-common/1.42.1/opentelemetry-sdk-common-1.42.1.jar:/Users/joel_arias/.m2/repository/io/opentelemetry/opentelemetry-sdk-extension-autoconfigure-spi/1.42.1/opentelemetry-sdk-extension-autoconfigure-spi-1.42.1.jar:/Users/joel_arias/.m2/repository/io/opentelemetry/opentelemetry-sdk-extension-autoconfigure/1.42.1/opentelemetry-sdk-extension-autoconfigure-1.42.1.jar:/Users/joel_arias/.m2/repository/io/opentelemetry/opentelemetry-api-incubator/1.42.1-alpha/opentelemetry-api-incubator-1.42.1-alpha.jar:/Users/joel_arias/.m2/repository/io/opentelemetry/opentelemetry-sdk-trace/1.42.1/opentelemetry-sdk-trace-1.42.1.jar:/Users/joel_arias/.m2/repository/io/opentelemetry/opentelemetry-sdk/1.42.1/opentelemetry-sdk-1.42.1.jar:/Users/joel_arias/.m2/repository/io/opentelemetry/opentelemetry-sdk-metrics/1.42.1/opentelemetry-sdk-metrics-1.42.1.jar:/Users/joel_arias/.m2/repository/io/opentelemetry/opentelemetry-sdk-logs/1.42.1/opentelemetry-sdk-logs-1.42.1.jar:/Users/joel_arias/.m2/repository/net/bytebuddy/byte-buddy/1.15.1/byte-buddy-1.15.1.jar:/Users/joel_arias/.m2/repository/org/seleniumhq/selenium/selenium-http/4.25.0/selenium-http-4.25.0.jar:/Users/joel_arias/.m2/repository/dev/failsafe/failsafe/3.3.2/failsafe-3.3.2.jar:/Users/joel_arias/.m2/repository/org/seleniumhq/selenium/selenium-json/4.25.0/selenium-json-4.25.0.jar:/Users/joel_arias/.m2/repository/org/seleniumhq/selenium/selenium-manager/4.25.0/selenium-manager-4.25.0.jar:/Users/joel_arias/.m2/repository/org/seleniumhq/selenium/selenium-os/4.25.0/selenium-os-4.25.0.jar:/Users/joel_arias/.m2/repository/org/apache/commons/commons-exec/1.4.0/commons-exec-1.4.0.jar:/Users/joel_arias/.m2/repository/commons-io/commons-io/2.15.1/commons-io-2.15.1.jar:/Users/joel_arias/.m2/repository/io/github/bonigarcia/webdrivermanager/5.6.4/webdrivermanager-5.6.4.jar:/Users/joel_arias/.m2/repository/com/google/code/gson/gson/2.10.1/gson-2.10.1.jar:/Users/joel_arias/.m2/repository/com/github/docker-java/docker-java/3.3.4/docker-java-3.3.4.jar:/Users/joel_arias/.m2/repository/com/github/docker-java/docker-java-core/3.3.4/docker-java-core-3.3.4.jar:/Users/joel_arias/.m2/repository/com/github/docker-java/docker-java-api/3.3.4/docker-java-api-3.3.4.jar:/Users/joel_arias/.m2/repository/org/bouncycastle/bcpkix-jdk18on/1.76/bcpkix-jdk18on-1.76.jar:/Users/joel_arias/.m2/repository/org/bouncycastle/bcprov-jdk18on/1.76/bcprov-jdk18on-1.76.jar:/Users/joel_arias/.m2/repository/org/bouncycastle/bcutil-jdk18on/1.76/bcutil-jdk18on-1.76.jar:/Users/joel_arias/.m2/repository/com/github/docker-java/docker-java-transport-httpclient5/3.3.4/docker-java-transport-httpclient5-3.3.4.jar:/Users/joel_arias/.m2/repository/com/github/docker-java/docker-java-transport/3.3.4/docker-java-transport-3.3.4.jar:/Users/joel_arias/.m2/repository/net/java/dev/jna/jna/5.13.0/jna-5.13.0.jar:/Users/joel_arias/.m2/repository/org/brotli/dec/0.1.2/dec-0.1.2.jar:/Users/joel_arias/.m2/repository/org/apache/commons/commons-lang3/3.14.0/commons-lang3-3.14.0.jar:/Users/joel_arias/.m2/repository/org/apache/commons/commons-compress/1.26.0/commons-compress-1.26.0.jar:/Users/joel_arias/.m2/repository/org/apache/httpcomponents/client5/httpclient5/5.2.1/httpclient5-5.2.1.jar:/Users/joel_arias/.m2/repository/org/apache/httpcomponents/core5/httpcore5/5.2/httpcore5-5.2.jar:/Users/joel_arias/.m2/repository/org/apache/httpcomponents/core5/httpcore5-h2/5.2/httpcore5-h2-5.2.jar:/Users/joel_arias/.m2/repository/io/cucumber/cucumber-junit/7.17.0/cucumber-junit-7.17.0.jar:/Users/joel_arias/.m2/repository/org/apiguardian/apiguardian-api/1.1.2/apiguardian-api-1.1.2.jar:/Users/joel_arias/.m2/repository/io/cucumber/cucumber-core/7.17.0/cucumber-core-7.17.0.jar:/Users/joel_arias/.m2/repository/io/cucumber/cucumber-gherkin/7.17.0/cucumber-gherkin-7.17.0.jar:/Users/joel_arias/.m2/repository/io/cucumber/cucumber-gherkin-messages/7.17.0/cucumber-gherkin-messages-7.17.0.jar:/Users/joel_arias/.m2/repository/io/cucumber/gherkin/28.0.0/gherkin-28.0.0.jar:/Users/joel_arias/.m2/repository/io/cucumber/messages/24.1.0/messages-24.1.0.jar:/Users/joel_arias/.m2/repository/io/cucumber/testng-xml-formatter/0.1.0/testng-xml-formatter-0.1.0.jar:/Users/joel_arias/.m2/repository/io/cucumber/query/12.2.0/query-12.2.0.jar:/Users/joel_arias/.m2/repository/io/cucumber/tag-expressions/6.1.0/tag-expressions-6.1.0.jar:/Users/joel_arias/.m2/repository/io/cucumber/cucumber-expressions/17.1.0/cucumber-expressions-17.1.0.jar:/Users/joel_arias/.m2/repository/io/cucumber/datatable/7.17.0/datatable-7.17.0.jar:/Users/joel_arias/.m2/repository/io/cucumber/cucumber-plugin/7.17.0/cucumber-plugin-7.17.0.jar:/Users/joel_arias/.m2/repository/io/cucumber/docstring/7.17.0/docstring-7.17.0.jar:/Users/joel_arias/.m2/repository/io/cucumber/html-formatter/21.3.1/html-formatter-21.3.1.jar:/Users/joel_arias/.m2/repository/io/cucumber/junit-xml-formatter/0.4.0/junit-xml-formatter-0.4.0.jar:/Users/joel_arias/.m2/repository/io/cucumber/ci-environment/10.0.1/ci-environment-10.0.1.jar:/Users/joel_arias/.m2/repository/junit/junit/4.13.2/junit-4.13.2.jar:/Users/joel_arias/.m2/repository/org/hamcrest/hamcrest-core/1.3/hamcrest-core-1.3.jar:/Users/joel_arias/.m2/repository/io/cucumber/cucumber-java/7.17.0/cucumber-java-7.17.0.jar:/Users/joel_arias/.m2/repository/org/opentest4j/opentest4j/1.3.0/opentest4j-1.3.0.jar:/Users/joel_arias/.m2/repository/net/masterthought/cucumber-reporting/5.8.2/cucumber-reporting-5.8.2.jar:/Users/joel_arias/.m2/repository/com/fasterxml/jackson/core/jackson-databind/2.17.0/jackson-databind-2.17.0.jar:/Users/joel_arias/.m2/repository/com/fasterxml/jackson/core/jackson-annotations/2.17.0/jackson-annotations-2.17.0.jar:/Users/joel_arias/.m2/repository/com/fasterxml/jackson/core/jackson-core/2.17.0/jackson-core-2.17.0.jar:/Users/joel_arias/.m2/repository/com/fasterxml/jackson/datatype/jackson-datatype-jsr310/2.17.0/jackson-datatype-jsr310-2.17.0.jar:/Users/joel_arias/.m2/repository/org/apache/velocity/velocity-engine-core/2.3/velocity-engine-core-2.3.jar:/Users/joel_arias/.m2/repository/joda-time/joda-time/2.12.7/joda-time-2.12.7.jar:/Users/joel_arias/.m2/repository/org/apache/commons/commons-configuration2/2.10.1/commons-configuration2-2.10.1.jar:/Users/joel_arias/.m2/repository/org/apache/commons/commons-text/1.11.0/commons-text-1.11.0.jar:/Users/joel_arias/.m2/repository/org/jsoup/jsoup/1.17.2/jsoup-1.17.2.jar:/Users/joel_arias/.m2/repository/com/googlecode/owasp-java-html-sanitizer/owasp-java-html-sanitizer/20240325.1/owasp-java-html-sanitizer-20240325.1.jar:/Users/joel_arias/.m2/repository/com/googlecode/owasp-java-html-sanitizer/java8-shim/20240325.1/java8-shim-20240325.1.jar:/Users/joel_arias/.m2/repository/com/googlecode/owasp-java-html-sanitizer/java10-shim/20240325.1/java10-shim-20240325.1.jar:/Users/joel_arias/.m2/repository/org/slf4j/jcl-over-slf4j/2.0.13/jcl-over-slf4j-2.0.13.jar:/Users/joel_arias/.m2/repository/org/slf4j/slf4j-api/2.0.16/slf4j-api-2.0.16.jar:/Users/joel_arias/.m2/repository/org/slf4j/slf4j-reload4j/2.0.16/slf4j-reload4j-2.0.16.jar:/Users/joel_arias/.m2/repository/ch/qos/reload4j/reload4j/1.2.22/reload4j-1.2.22.jar:/Users/joel_arias/.m2/repository/log4j/log4j/1.2.17/log4j-1.2.17.jar:/Users/joel_arias/.m2/repository/org/apache/logging/log4j/log4j-api/2.8.2/log4j-api-2.8.2.jar:/Users/joel_arias/.m2/repository/org/apache/logging/log4j/log4j-core/2.17.2/log4j-core-2.17.2.jar:"/>
    <property name="sun.cpu.endian" value="little"/>
    <property name="user.home" value="/Users/joel_arias"/>
    <property name="user.language" value="en"/>
    <property name="java.specification.vendor" value="Oracle Corporation"/>
    <property name="java.version.date" value="2024-07-16"/>
    <property name="java.home" value="/opt/homebrew/Cellar/openjdk/22.0.2/libexec/openjdk.jdk/Contents/Home"/>
    <property name="file.separator" value="/"/>
    <property name="basedir" value="/Users/joel_arias/Documents/Coding/Testing/Front_End/Java/Cucumber/Practice/webstaurantstore_cucumber_page_factory"/>
    <property name="java.vm.compressedOopsMode" value="Zero based"/>
    <property name="line.separator" value="&#10;"/>
    <property name="java.vm.specification.vendor" value="Oracle Corporation"/>
    <property name="java.specification.name" value="Java Platform API Specification"/>
    <property name="apple.awt.application.name" value="ForkedBooter"/>
    <property name="surefire.real.class.path" value="/Users/joel_arias/Documents/Coding/Testing/Front_End/Java/Cucumber/Practice/webstaurantstore_cucumber_page_factory/target/surefire/surefirebooter-20241020162020402_3.jar"/>
    <property name="sun.management.compiler" value="HotSpot 64-Bit Tiered Compilers"/>
    <property name="ftp.nonProxyHosts" value="local|*.local|169.254/16|*.169.254/16"/>
    <property name="java.runtime.version" value="22.0.2"/>
    <property name="user.name" value="joel_arias"/>
    <property name="stdout.encoding" value="UTF-8"/>
    <property name="path.separator" value=":"/>
    <property name="os.version" value="15.0.1"/>
    <property name="java.runtime.name" value="OpenJDK Runtime Environment"/>
    <property name="file.encoding" value="UTF-8"/>
    <property name="java.vm.name" value="OpenJDK 64-Bit Server VM"/>
    <property name="java.vendor.version" value="Homebrew"/>
    <property name="localRepository" value="/Users/joel_arias/.m2/repository"/>
    <property name="java.vendor.url.bug" value="https://github.com/Homebrew/homebrew-core/issues"/>
    <property name="java.io.tmpdir" value="/var/folders/0l/8ysf7sf95nn75yd4vn60vr3m0000gn/T/"/>
    <property name="java.version" value="22.0.2"/>
    <property name="user.dir" value="/Users/joel_arias/Documents/Coding/Testing/Front_End/Java/Cucumber/Practice/webstaurantstore_cucumber_page_factory"/>
    <property name="os.arch" value="aarch64"/>
    <property name="java.vm.specification.name" value="Java Virtual Machine Specification"/>
    <property name="native.encoding" value="UTF-8"/>
    <property name="java.library.path" value="/Users/joel_arias/Library/Java/Extensions:/Library/Java/Extensions:/Network/Library/Java/Extensions:/System/Library/Java/Extensions:/usr/lib/java:."/>
    <property name="java.vm.info" value="mixed mode, sharing"/>
    <property name="stderr.encoding" value="UTF-8"/>
    <property name="java.vendor" value="Homebrew"/>
    <property name="java.vm.version" value="22.0.2"/>
    <property name="sun.io.unicode.encoding" value="UnicodeBig"/>
    <property name="socksNonProxyHosts" value="local|*.local|169.254/16|*.169.254/16"/>
    <property name="java.class.version" value="66.0"/>
  </properties>
  <testcase name="Check page &quot;Table&quot; keyword" classname="Search tables" time="19.289">
    <system-out><![CDATA[
@Regression @CheckTables @SearchTables
Scenario Outline: Check page "Table" keyword                                                                                                        &amp#27;[90m# src/test/features/com/webstaurantstore_cucumber_page_factory/Search_tables.feature:15&amp#27;[0m
  &amp#27;[32mGiven &amp#27;[0m&amp#27;[32mA user navigates to HomePage&amp#27;[0m                                                                                                                &amp#27;[90m# com.webstaurantstore_cucumber_page_factory.tests.SearchTablesSteps.a_user_navigates_to_HomePage()&amp#27;[0m
  &amp#27;[32mWhen &amp#27;[0m&amp#27;[32muser search and submit for &amp#27;[0m&amp#27;[32m&amp#27;[1mstainless work table&amp#27;[0m                                                                                              &amp#27;[90m# com.webstaurantstore_cucumber_page_factory.tests.SearchTablesSteps.user_search_and_submit(java.lang.String)&amp#27;[0m
searchPage.getTitle(): Stainless Work Table - WebstaurantStore
searchTitle: Stainless Work Table - WebstaurantStore
  &amp#27;[32mThen &amp#27;[0m&amp#27;[32mall search result pages have the following title &amp#27;[0m&amp#27;[32m&amp#27;[1mStainless Work Table - WebstaurantStore&amp#27;[0m&amp#27;[32m and all item descriptions contain the keyword &amp#27;[0m&amp#27;[32m&amp#27;[1mTable&amp#27;[0m &amp#27;[90m# com.webstaurantstore_cucumber_page_factory.tests.SearchTablesSteps.search_result_is_displayed(java.lang.String,java.lang.String)&amp#27;[0m
]]></system-out>
  </testcase>
  <testcase name="Add last item to cart" classname="Shopping_cart" time="15.336">
    <system-out><![CDATA[
@Regression @ShoppingCart @AddLastItemToCart
Scenario Outline: Add last item to cart                                                             &amp#27;[90m# src/test/features/com/webstaurantstore_cucumber_page_factory/Shopping_cart.feature:24&amp#27;[0m
  &amp#27;[32mGiven &amp#27;[0m&amp#27;[32mA user navigates to HomePage&amp#27;[0m                                                                &amp#27;[90m# com.webstaurantstore_cucumber_page_factory.tests.SearchTablesSteps.a_user_navigates_to_HomePage()&amp#27;[0m
  &amp#27;[32mWhen &amp#27;[0m&amp#27;[32mthe user search and submit for &amp#27;[0m&amp#27;[32m&amp#27;[1mstainless work table&amp#27;[0m                                          &amp#27;[90m# com.webstaurantstore_cucumber_page_factory.tests.ShoppingCartSteps.search_and_sumbit_for(java.lang.String)&amp#27;[0m
searchPage.getTitle(): Stainless Work Table - WebstaurantStore
searchTitle: Stainless Work Table - WebstaurantStore
  &amp#27;[32mThen &amp#27;[0m&amp#27;[32mthe displayed search result title is &amp#27;[0m&amp#27;[32m&amp#27;[1mStainless Work Table - WebstaurantStore&amp#27;[0m                 &amp#27;[90m# com.webstaurantstore_cucumber_page_factory.tests.ShoppingCartSteps.the_displayed_search_result_title_is(java.lang.String)&amp#27;[0m
  &amp#27;[32mWhen &amp#27;[0m&amp#27;[32mthe user adds the last available item to the cart&amp#27;[0m                                            &amp#27;[90m# com.webstaurantstore_cucumber_page_factory.tests.ShoppingCartSteps.user_adds_last_item_to_cart()&amp#27;[0m
  &amp#27;[32mThen &amp#27;[0m&amp#27;[32ma item added confirmation alert is displayed with following legend &amp#27;[0m&amp#27;[32m&amp#27;[1m1 item added to your cart&amp#27;[0m &amp#27;[90m# com.webstaurantstore_cucumber_page_factory.tests.ShoppingCartSteps.a_item_added_confirmation_alert_is_displayed(java.lang.String)&amp#27;[0m
  &amp#27;[32mAnd &amp#27;[0m&amp#27;[32mthe item description is displayed in the item added confirmation alert&amp#27;[0m                        &amp#27;[90m# com.webstaurantstore_cucumber_page_factory.tests.ShoppingCartSteps.the_item_description_is_diplayed_in_the_item_added_confirmation_alert()&amp#27;[0m
  &amp#27;[32mWhen &amp#27;[0m&amp#27;[32mthe user clicks on View Cart Button&amp#27;[0m                                                          &amp#27;[90m# com.webstaurantstore_cucumber_page_factory.tests.ShoppingCartSteps.the_user_clicks_on_view_cart_button()&amp#27;[0m
  &amp#27;[32mThen &amp#27;[0m&amp#27;[32mthe cart page is displayed with following title &amp#27;[0m&amp#27;[32m&amp#27;[1mWebstaurantStore Cart&amp#27;[0m                        &amp#27;[90m# com.webstaurantstore_cucumber_page_factory.tests.ShoppingCartSteps.cart_page_displayed(java.lang.String)&amp#27;[0m
  &amp#27;[32mAnd &amp#27;[0m&amp#27;[32mthe item is displayed in the cart&amp#27;[0m                                                             &amp#27;[90m# com.webstaurantstore_cucumber_page_factory.tests.ShoppingCartSteps.item_displayed_in_the_cart()&amp#27;[0m
  &amp#27;[32mAnd &amp#27;[0m&amp#27;[32mitem quantity is equal to &amp#27;[0m&amp#27;[32m&amp#27;[1m1&amp#27;[0m                                                                   &amp#27;[90m# com.webstaurantstore_cucumber_page_factory.tests.ShoppingCartSteps.item_quantity_is_equal_to_1(java.lang.String)&amp#27;[0m
  &amp#27;[32mAnd &amp#27;[0m&amp#27;[32mthe following empty cart button is displayed: &amp#27;[0m&amp#27;[32m&amp#27;[1mEmpty Cart&amp#27;[0m                                      &amp#27;[90m# com.webstaurantstore_cucumber_page_factory.tests.ShoppingCartSteps.empty_cart_button_is_displayed(java.lang.String)&amp#27;[0m
]]></system-out>
  </testcase>
  <testcase name="Empty a shopping cart with at least one item" classname="Shopping_cart" time="8.628">
    <system-out><![CDATA[
@Regression @ShoppingCart @EmptyCart
Scenario Outline: Empty a shopping cart with at least one item                                      &amp#27;[90m# src/test/features/com/webstaurantstore_cucumber_page_factory/Shopping_cart.feature:43&amp#27;[0m
  &amp#27;[32mGiven &amp#27;[0m&amp#27;[32mA user navigates to HomePage&amp#27;[0m                                                                &amp#27;[90m# com.webstaurantstore_cucumber_page_factory.tests.SearchTablesSteps.a_user_navigates_to_HomePage()&amp#27;[0m
  &amp#27;[32mWhen &amp#27;[0m&amp#27;[32mthe user search and submit for &amp#27;[0m&amp#27;[32m&amp#27;[1mstainless work table&amp#27;[0m                                          &amp#27;[90m# com.webstaurantstore_cucumber_page_factory.tests.ShoppingCartSteps.search_and_sumbit_for(java.lang.String)&amp#27;[0m
searchPage.getTitle(): Stainless Work Table - WebstaurantStore
searchTitle: Stainless Work Table - WebstaurantStore
  &amp#27;[32mThen &amp#27;[0m&amp#27;[32mthe displayed search result title is &amp#27;[0m&amp#27;[32m&amp#27;[1mStainless Work Table - WebstaurantStore&amp#27;[0m                 &amp#27;[90m# com.webstaurantstore_cucumber_page_factory.tests.ShoppingCartSteps.the_displayed_search_result_title_is(java.lang.String)&amp#27;[0m
  &amp#27;[32mWhen &amp#27;[0m&amp#27;[32mthe user adds the first item to the cart&amp#27;[0m                                                     &amp#27;[90m# com.webstaurantstore_cucumber_page_factory.tests.ShoppingCartSteps.the_user_adds_the_first_item_to_the_cart()&amp#27;[0m
  &amp#27;[32mThen &amp#27;[0m&amp#27;[32ma item added confirmation alert is displayed with following legend &amp#27;[0m&amp#27;[32m&amp#27;[1m1 item added to your cart&amp#27;[0m &amp#27;[90m# com.webstaurantstore_cucumber_page_factory.tests.ShoppingCartSteps.a_item_added_confirmation_alert_is_displayed(java.lang.String)&amp#27;[0m
  &amp#27;[32mAnd &amp#27;[0m&amp#27;[32mthe item description is displayed in the item added confirmation alert&amp#27;[0m                        &amp#27;[90m# com.webstaurantstore_cucumber_page_factory.tests.ShoppingCartSteps.the_item_description_is_diplayed_in_the_item_added_confirmation_alert()&amp#27;[0m
  &amp#27;[32mWhen &amp#27;[0m&amp#27;[32mthe user clicks on View Cart Button&amp#27;[0m                                                          &amp#27;[90m# com.webstaurantstore_cucumber_page_factory.tests.ShoppingCartSteps.the_user_clicks_on_view_cart_button()&amp#27;[0m
  &amp#27;[32mThen &amp#27;[0m&amp#27;[32mthe cart page is displayed with following title &amp#27;[0m&amp#27;[32m&amp#27;[1mWebstaurantStore Cart&amp#27;[0m                        &amp#27;[90m# com.webstaurantstore_cucumber_page_factory.tests.ShoppingCartSteps.cart_page_displayed(java.lang.String)&amp#27;[0m
  &amp#27;[32mAnd &amp#27;[0m&amp#27;[32mthe item is displayed in the cart&amp#27;[0m                                                             &amp#27;[90m# com.webstaurantstore_cucumber_page_factory.tests.ShoppingCartSteps.item_displayed_in_the_cart()&amp#27;[0m
  &amp#27;[32mAnd &amp#27;[0m&amp#27;[32mthe following empty cart button is displayed: &amp#27;[0m&amp#27;[32m&amp#27;[1mEmpty Cart&amp#27;[0m                                      &amp#27;[90m# com.webstaurantstore_cucumber_page_factory.tests.ShoppingCartSteps.empty_cart_button_is_displayed(java.lang.String)&amp#27;[0m
  &amp#27;[32mWhen &amp#27;[0m&amp#27;[32mthe user clicks on the "Empty Cart" button&amp#27;[0m                                                   &amp#27;[90m# com.webstaurantstore_cucumber_page_factory.tests.ShoppingCartSteps.user_clicks_empty_cart_button()&amp#27;[0m
  &amp#27;[32mThen &amp#27;[0m&amp#27;[32mthe following confirmation dialog is displayed: &amp#27;[0m&amp#27;[32m&amp#27;[1mEmpty Cart&amp#27;[0m                                   &amp#27;[90m# com.webstaurantstore_cucumber_page_factory.tests.ShoppingCartSteps.confirmation_dialog_is_displayed(java.lang.String)&amp#27;[0m
  &amp#27;[32mAnd &amp#27;[0m&amp#27;[32mthe user confirms emptying the cart&amp#27;[0m                                                           &amp#27;[90m# com.webstaurantstore_cucumber_page_factory.tests.ShoppingCartSteps.user_confirms_to_empty_cart()&amp#27;[0m
  &amp#27;[32mThen &amp#27;[0m&amp#27;[32mthe cart is empty, and following message is displayed: &amp#27;[0m&amp#27;[32m&amp#27;[1mYour cart is empty.&amp#27;[0m                   &amp#27;[90m# com.webstaurantstore_cucumber_page_factory.tests.ShoppingCartSteps.verify_if_cart_is_empty(java.lang.String)&amp#27;[0m
]]></system-out>
  </testcase>
  <testcase name="Verify if the cart is empty" classname="Shopping_cart" time="6.01">
    <system-out><![CDATA[
@Regression @ShoppingCart
Scenario Outline: Verify if the cart is empty                                    &amp#27;[90m# src/test/features/com/webstaurantstore_cucumber_page_factory/Shopping_cart.feature:52&amp#27;[0m
  &amp#27;[32mGiven &amp#27;[0m&amp#27;[32mA user navigates to HomePage&amp#27;[0m                                             &amp#27;[90m# com.webstaurantstore_cucumber_page_factory.tests.SearchTablesSteps.a_user_navigates_to_HomePage()&amp#27;[0m
  &amp#27;[32mWhen &amp#27;[0m&amp#27;[32mthe user clicks on "cart" button&amp#27;[0m                                          &amp#27;[90m# com.webstaurantstore_cucumber_page_factory.tests.ShoppingCartSteps.user_clicks_cart_button()&amp#27;[0m
  &amp#27;[32mThen &amp#27;[0m&amp#27;[32mthe cart page is displayed with following title &amp#27;[0m&amp#27;[32m&amp#27;[1mWebstaurantStore Cart&amp#27;[0m     &amp#27;[90m# com.webstaurantstore_cucumber_page_factory.tests.ShoppingCartSteps.cart_page_displayed(java.lang.String)&amp#27;[0m
  &amp#27;[32mAnd &amp#27;[0m&amp#27;[32mthe cart is empty, and following message is displayed: &amp#27;[0m&amp#27;[32m&amp#27;[1mYour cart is empty.&amp#27;[0m &amp#27;[90m# com.webstaurantstore_cucumber_page_factory.tests.ShoppingCartSteps.verify_if_cart_is_empty(java.lang.String)&amp#27;[0m
]]></system-out>
  </testcase>
</testsuite>