2024-10-20 16:20:20 DEBUG WebDriverManager:227 - Using WebDriverManager 5.6.4
2024-10-20 16:20:21 DEBUG ResolutionCache:186 - Resolution chrome=129 in cache (valid until 16:25:22 20/10/2024 CDT)
2024-10-20 16:20:21 DEBUG ResolutionCache:186 - Resolution chrome129=129.0.6668.100 in cache (valid until 15:25:22 21/10/2024 CDT)
2024-10-20 16:20:21 INFO  WebDriverManager:1239 - Using chromedriver 129.0.6668.100 (resolved driver for Chrome 129)
2024-10-20 16:20:21 DEBUG WebDriverManager:1194 - Driver chromedriver 129.0.6668.100 found in cache
2024-10-20 16:20:21 INFO  WebDriverManager:1301 - Exporting webdriver.chrome.driver as /Users/joel_arias/.cache/selenium/chromedriver/mac-arm64/129.0.6668.100/chromedriver
2024-10-20 16:20:40 DEBUG WebDriverManager:227 - Using WebDriverManager 5.6.4
2024-10-20 16:20:40 DEBUG ResolutionCache:186 - Resolution chrome=129 in cache (valid until 16:25:22 20/10/2024 CDT)
2024-10-20 16:20:40 DEBUG ResolutionCache:186 - Resolution chrome129=129.0.6668.100 in cache (valid until 15:25:22 21/10/2024 CDT)
2024-10-20 16:20:40 INFO  WebDriverManager:1239 - Using chromedriver 129.0.6668.100 (resolved driver for Chrome 129)
2024-10-20 16:20:40 DEBUG WebDriverManager:1194 - Driver chromedriver 129.0.6668.100 found in cache
2024-10-20 16:20:40 INFO  WebDriverManager:1301 - Exporting webdriver.chrome.driver as /Users/joel_arias/.cache/selenium/chromedriver/mac-arm64/129.0.6668.100/chromedriver
2024-10-20 16:20:55 DEBUG WebDriverManager:227 - Using WebDriverManager 5.6.4
2024-10-20 16:20:55 DEBUG ResolutionCache:186 - Resolution chrome=129 in cache (valid until 16:25:22 20/10/2024 CDT)
2024-10-20 16:20:55 DEBUG ResolutionCache:186 - Resolution chrome129=129.0.6668.100 in cache (valid until 15:25:22 21/10/2024 CDT)
2024-10-20 16:20:55 INFO  WebDriverManager:1239 - Using chromedriver 129.0.6668.100 (resolved driver for Chrome 129)
2024-10-20 16:20:55 DEBUG WebDriverManager:1194 - Driver chromedriver 129.0.6668.100 found in cache
2024-10-20 16:20:55 INFO  WebDriverManager:1301 - Exporting webdriver.chrome.driver as /Users/joel_arias/.cache/selenium/chromedriver/mac-arm64/129.0.6668.100/chromedriver
2024-10-20 16:21:04 DEBUG WebDriverManager:227 - Using WebDriverManager 5.6.4
2024-10-20 16:21:04 DEBUG ResolutionCache:186 - Resolution chrome=129 in cache (valid until 16:25:22 20/10/2024 CDT)
2024-10-20 16:21:04 DEBUG ResolutionCache:186 - Resolution chrome129=129.0.6668.100 in cache (valid until 15:25:22 21/10/2024 CDT)
2024-10-20 16:21:04 INFO  WebDriverManager:1239 - Using chromedriver 129.0.6668.100 (resolved driver for Chrome 129)
2024-10-20 16:21:04 DEBUG WebDriverManager:1194 - Driver chromedriver 129.0.6668.100 found in cache
2024-10-20 16:21:04 INFO  WebDriverManager:1301 - Exporting webdriver.chrome.driver as /Users/joel_arias/.cache/selenium/chromedriver/mac-arm64/129.0.6668.100/chromedriver
