<svg width="1079.94368" height="779.70903" xmlns="http://www.w3.org/2000/svg" style="vector-effect: non-scaling-stroke;" stroke="null">
 <title style="vector-effect: non-scaling-stroke;" stroke="null">begin chat</title>
 <g stroke="null">
  <title stroke="null">background</title>
  <rect stroke="null" fill="none" id="canvas_background" height="781.70903" width="1081.94368" y="-1" x="-1"/>
 </g>
 <g stroke="null">
  <title stroke="null">Layer 1</title>
  <defs stroke="null">
   <linearGradient stroke="null" y2="0.500118" x2="1" y1="0.500118" x1="0.000418" id="svg_813">
    <stop stroke="null" stop-opacity="0.25" stop-color="gray" offset="0"/>
    <stop stroke="null" stop-opacity="0.12" stop-color="gray" offset="0.54"/>
    <stop stroke="null" stop-opacity="0.1" stop-color="gray" offset="1"/>
   </linearGradient>
  </defs>
  <g stroke="null" id="svg_1">
   <g stroke="null" id="svg_351" transform="matrix(-0.3827998247250145,-0.9932327482473884,0.9766368224158637,-0.38930471718211246,-1610.742496663036,10251.367982877635) ">
    <title stroke="null" transform="translate(-2.42918062210083,11.334930419921875) translate(27.45733070373535,-19.456111907958984) translate(69.20669555664062,-14.789039611816406) translate(-244.94546508789062,172.26934814453125) ">Layer 1</title>
    <path stroke="null" id="svg_335" fill="#f9a826" d="m8140.983541,5272.061757c0,35.17 -8.33,64.12 -22.7799,88.92a177.67758,177.67758 0 0 1 -16.19,23.25c-53.12,64.97 -151.88,100.53 -241.14,158.13c-263.48,170.02 -292.02,-102.42 -280.12,-270.3c4.8,-67.74 31.18,-129.79 73.09,-177.3a278.22062,278.22062 0 0 1 28.45,-27.97c47.58,-40.52 109.05,-65.04 178.58,-65.04c119.29,0 221.16,71.95 261.55,173.34a261.84957,261.84957 0 0 1 18.55993,96.97l-0.00003,0z"/>
    <path stroke="null" id="svg_336" fill="#d0cde1" d="m7920.553651,5062.671737l-266.71,32.09a278.22062,278.22062 0 0 1 28.45,-27.97l238.26,-4.12z"/>
    <path stroke="null" id="svg_337" fill="#d0cde1" d="m8118.203651,5360.981737a177.67758,177.67758 0 0 1 -16.19,23.25l-228.46,-27.48l244.65,4.23z"/>
    <path stroke="null" id="svg_338" fill="#d0cde1" d="m8131.743551,5202.971727l-387.18994,-50.22l377.87,22.34a260.439,260.439 0 0 1 9.31994,27.88z"/>
    <path stroke="null" id="svg_339" fill="#f9a826" d="m7607.018181,5073.753897c0,0.69 -0.02,1.37 -0.08,2.04a27.99706,27.99706 0 1 1 -52.68,-15.11a25.73956,25.73956 0 0 1 2.06,-3.31a27.9889,27.9889 0 0 1 50.6,14.1c0.06997,0.74997 0.1,1.50998 0.1,2.28z"/>
    <path stroke="null" id="svg_340" fill="#d0cde1" d="m7607.018181,5073.753897c0,0.69 -0.02,1.37 -0.08,2.04l-41.92,-5.04l41.9,0.72c0.06997,0.74997 0.1,1.50998 0.1,2.28z"/>
    <path stroke="null" id="svg_341" fill="#d0cde1" d="m7597.018181,5087.863877l-38.78,4.67a28.05694,28.05694 0 0 1 -2.96,-3.95l41.74,-0.72z"/>
    <path stroke="null" id="svg_342" fill="#d0cde1" d="m7586.018181,5056.863877l-31.76,3.82a25.73956,25.73956 0 0 1 2.06,-3.31l29.7,-0.51z"/>
    <path stroke="null" id="svg_343" fill="#f9a826" d="m7990.751081,5577.879587c-0.32346,0.60949 -0.65991,1.20075 -1.027,1.76443a27.99706,27.99706 0 1 1 -39.45,-38.042a25.73938,25.73938 0 0 1 3.37127,-1.9581a27.98891,27.98891 0 0 1 38.08621,36.17477c-0.28977,0.69535 -0.61952,1.38072 -0.98048,2.0609z"/>
    <path stroke="null" id="svg_344" fill="#d0cde1" d="m7990.751081,5577.879587c-0.32346,0.60949 -0.65991,1.20075 -1.027,1.76443l-34.66603,-24.10292l36.67354,20.27763c-0.2898,0.69531 -0.61955,1.38068 -0.98051,2.06086z"/>
    <path stroke="null" id="svg_345" fill="#d0cde1" d="m7975.303501,5585.655437l-36.44426,-14.054a28.05745,28.05745 0 0 1 -0.76292,-4.87668l37.20718,18.93068z"/>
    <path stroke="null" id="svg_346" fill="#d0cde1" d="m7980.119011,5553.116037l-29.8449,-11.514a25.73938,25.73938 0 0 1 3.37127,-1.9581l26.47363,13.4721z"/>
    <path stroke="null" id="svg_347" fill="#f9a826" d="m8189.063461,5095.204297c0.48176,0.494 0.9422,0.99477 1.367,1.5163a27.99707,27.99707 0 1 1 -48.26355,25.96387a25.73851,25.73851 0 0 1 -0.83628,-3.80793a27.9889,27.9889 0 0 1 46.06931,-25.23471c0.57376,0.48809 1.1259,1.01121 1.66352,1.56247z"/>
    <path stroke="null" id="svg_348" fill="#d0cde1" d="m8189.063461,5095.204297c0.48176,0.494 0.9422,0.99477 1.367,1.5163l-33.52955,25.66038l30.499,-28.73915c0.57379,0.48809 1.12593,1.01121 1.66355,1.56247z"/>
    <path stroke="null" id="svg_349" fill="#d0cde1" d="m8191.756021,5112.287677l-24.50216,30.41946a28.0572,28.0572 0 0 1 -4.87694,-0.76118l29.3791,-29.65828z"/>
    <path stroke="null" id="svg_350" fill="#d0cde1" d="m8162.236901,5097.774877l-20.07,24.90959a25.73851,25.73851 0 0 1 -0.83628,-3.80793l20.90628,-21.10166z"/>
   </g>
   <g stroke="null" id="svg_333" transform="matrix(0.8811709741206044,0.43114404774039644,-0.4239400619156955,0.896144655017894,-2985.91217810179,-6880.800790058951) ">
    <title stroke="null" transform="translate(10.186641693115234,-7.132676601409912) translate(-35.78398513793945,-4.763864040374756) translate(-65.18122100830078,-38.92052459716797) translate(-262.7630615234375,184.80039978027344) ">Layer 1</title>
    <path stroke="null" id="svg_317" fill="#333333" d="m6719.765924,4991.140455c0,35.17 -8.33,64.12 -22.7799,88.92a177.67758,177.67758 0 0 1 -16.19,23.25c-53.12,64.97 -151.88,100.53 -241.14,158.13c-263.48,170.02 -292.02,-102.42 -280.12,-270.3c4.8,-67.74 31.18,-129.79 73.09,-177.3a278.22062,278.22062 0 0 1 28.45,-27.97c47.58,-40.52 109.05,-65.04 178.58,-65.04c119.29,0 221.16,71.95 261.55,173.34a261.84957,261.84957 0 0 1 18.55993,96.97l-0.00003,0z"/>
    <path stroke="null" id="svg_318" fill="#333333" d="m6499.336034,4781.750435l-266.71,32.09a278.22062,278.22062 0 0 1 28.45,-27.97l238.26,-4.12z"/>
    <path stroke="null" id="svg_319" fill="#333333" d="m6696.986034,5080.060435a177.67758,177.67758 0 0 1 -16.19,23.25l-228.46,-27.48l244.65,4.23z"/>
    <path stroke="null" id="svg_320" fill="#333333" d="m6710.525934,4922.050425l-387.18994,-50.22l377.87,22.34a260.439,260.439 0 0 1 9.31994,27.88z"/>
    <path stroke="null" id="svg_321" fill="#333333" d="m6185.800564,4792.832595c0,0.69 -0.02,1.37 -0.08,2.04a27.99706,27.99706 0 1 1 -52.68,-15.11a25.73956,25.73956 0 0 1 2.06,-3.31a27.9889,27.9889 0 0 1 50.6,14.1c0.06997,0.74997 0.1,1.50998 0.1,2.28z"/>
    <path stroke="null" id="svg_322" fill="#333333" d="m6185.800564,4792.832595c0,0.69 -0.02,1.37 -0.08,2.04l-41.92,-5.04l41.9,0.72c0.06997,0.74997 0.1,1.50998 0.1,2.28z"/>
    <path stroke="null" id="svg_323" fill="#333333" d="m6175.800564,4806.942575l-38.78,4.67a28.05694,28.05694 0 0 1 -2.96,-3.95l41.74,-0.72z"/>
    <path stroke="null" id="svg_324" fill="#333333" d="m6164.800564,4775.942575l-31.76,3.82a25.73956,25.73956 0 0 1 2.06,-3.31l29.7,-0.51z"/>
    <path stroke="null" id="svg_325" fill="#333333" d="m6569.533464,5296.958285c-0.32346,0.60949 -0.65991,1.20075 -1.027,1.76443a27.99706,27.99706 0 1 1 -39.45,-38.042a25.73938,25.73938 0 0 1 3.37127,-1.9581a27.98891,27.98891 0 0 1 38.08621,36.17477c-0.28977,0.69535 -0.61952,1.38072 -0.98048,2.0609z"/>
    <path stroke="null" id="svg_326" fill="#333333" d="m6569.533464,5296.958285c-0.32346,0.60949 -0.65991,1.20075 -1.027,1.76443l-34.66603,-24.10292l36.67354,20.27763c-0.2898,0.69531 -0.61955,1.38068 -0.98051,2.06086z"/>
    <path stroke="null" id="svg_327" fill="#333333" d="m6554.085884,5304.734135l-36.44426,-14.054a28.05745,28.05745 0 0 1 -0.76292,-4.87668l37.20718,18.93068z"/>
    <path stroke="null" id="svg_328" fill="#333333" d="m6558.901394,5272.194735l-29.8449,-11.514a25.73938,25.73938 0 0 1 3.37127,-1.9581l26.47363,13.4721z"/>
    <path stroke="null" id="svg_329" fill="#333333" d="m6767.845844,4814.282995c0.48176,0.494 0.9422,0.99477 1.367,1.5163a27.99707,27.99707 0 1 1 -48.26355,25.96387a25.73851,25.73851 0 0 1 -0.83628,-3.80793a27.9889,27.9889 0 0 1 46.06931,-25.23471c0.57376,0.48809 1.1259,1.01121 1.66352,1.56247z"/>
    <path stroke="null" id="svg_330" fill="#333333" d="m6767.845844,4814.282995c0.48176,0.494 0.9422,0.99477 1.367,1.5163l-33.52955,25.66038l30.499,-28.73915c0.57379,0.48809 1.12593,1.01121 1.66355,1.56247z"/>
    <path stroke="null" id="svg_331" fill="#333333" d="m6770.538404,4831.366375l-24.50216,30.41946a28.0572,28.0572 0 0 1 -4.87694,-0.76118l29.3791,-29.65828z"/>
    <path stroke="null" id="svg_332" fill="#333333" d="m6741.019284,4816.853575l-20.07,24.90959a25.73851,25.73851 0 0 1 -0.83628,-3.80793l20.90628,-21.10166z"/>
   </g>
   <g stroke="null" id="svg_960">
    <path stroke="null" id="svg_925" fill="#ffb8b8" d="m629.420401,262.068265s4.756329,62.883038 -1.902518,64.817899s-30.440537,16.446322 -68.491201,12.576599c0,0 -37.099398,20.316059 -31.391789,0.967474s31.391789,-14.511475 31.391789,-14.511475s45.660791,-9.674321 47.563323,-16.446336s-5.707595,-34.827534 -2.853784,-35.79495s25.684179,-11.609211 25.684179,-11.609211l0,0z"/>
    <path stroke="null" id="svg_926" opacity="0.2" fill="#231f20" d="m626.220056,262.88194s4.756329,62.883038 -1.902532,64.817899s-30.440523,16.446336 -68.491186,12.576613c0,0 -37.099398,20.316059 -31.391803,0.967459s31.391803,-14.51146 31.391803,-14.51146s45.660791,-9.674321 47.563323,-16.446336s-5.707595,-34.827534 -2.853798,-35.794964s25.684193,-11.609211 25.684193,-11.609211l0,0z"/>
    <path stroke="null" id="svg_927" fill="#2f2e41" d="m572.806958,364.04035s3.342525,105.835304 9.05012,119.379348c4.754226,11.281728 7.5284,48.070283 8.322521,60.045484c0.15922,2.401398 0.238858,3.804984 0.238858,3.804984s15.220268,0 16.171534,-3.869723s3.805064,-46.436702 0,-59.980746s5.421274,-113.683551 5.421274,-113.683551l-39.204307,-5.695796l0,0z"/>
    <path stroke="null" id="svg_928" fill="#2f2e41" d="m594.223549,542.432998s-9.512673,2.902292 -11.415205,6.772015s-33.294334,10.641752 -23.781661,15.478905s38.050664,-3.869723 38.050664,-3.869723s15.220268,-0.967431 14.269002,-6.772029s-4.415528,-12.956746 -4.415528,-12.956746l-12.707272,1.347577l0,0z"/>
    <path stroke="null" id="svg_929" fill="#2f2e41" d="m620.859008,545.525658s-9.512659,2.902292 -11.415205,6.772015s-33.29432,10.641752 -23.781647,15.478905s38.050664,-3.869737 38.050664,-3.869737s15.220268,-0.967416 14.269002,-6.772s-4.415528,-12.956746 -4.415528,-12.956746l-12.707287,1.347563l0,0z"/>
    <path stroke="null" id="svg_930" fill="#2f2e41" d="m580.905812,369.453143l13.317737,23.218351l22.226355,80.72594s-2.249757,74.063129 0.604069,74.063129s18.074066,4.837153 19.02529,0c0.803538,-4.086006 11.457967,-43.227272 6.147235,-69.279601a327.572216,333.13863 0 0 1 -6.647172,-49.98111l-2.353861,-45.202621s9.512673,-17.413781 -0.951266,-20.316059s-51.368386,6.771972 -51.368386,6.771972z"/>
    <circle stroke="null" transform="matrix(0.8000879626065317,0,0,0.813683805177026,-5549.015519081361,-1256.580298122043) " id="svg_931" fill="#ffb8b8" r="28.534861" cy="1786.72679" cx="7677.015635"/>
    <path stroke="null" id="svg_932" fill="#ffb8b8" d="m590.418485,212.729257s3.805064,30.957811 2.853798,32.892672s22.830395,-21.28349 22.830395,-21.28349s-8.561393,-13.544044 -6.658861,-20.316059l-19.025332,8.706876z"/>
    <path stroke="null" id="svg_933" fill="#575a89" d="m643.689404,243.687067s-26.635459,-19.348585 -27.586725,-23.218365l-19.976598,17.413767l-3.394464,-4.109193s-15.630868,15.718376 -15.630868,22.490391s-0.951308,27.088088 1.902532,32.892672s-8.561407,79.329374 -8.561407,79.329374s9.512673,8.706876 10.463939,9.674307s39.00193,-5.804584 39.00193,-5.804584s19.02529,-1.934861 19.02529,-4.837153s-5.707595,-46.436702 -3.805064,-58.045884s8.561435,-65.78533 8.561435,-65.78533l0,0z"/>
    <path stroke="null" id="svg_934" fill="#2f2e41" d="m583.520244,185.651736c3.12075,-1.129586 6.563538,-1.709705 9.745502,-0.773287c4.503467,1.325323 7.622494,5.339957 10.986577,8.66076s8.081687,6.263396 12.51129,4.701819a7.335213,7.45986 0 0 1 1.40124,-5.50942a4.982185,5.066847 0 0 0 1.244194,-2.105932c0.189248,-1.243556 -0.838988,-2.316114 -1.147333,-3.534788c-0.540342,-2.135624 0.940903,-5.05918 -0.88024,-6.256131c-0.480708,-0.315954 -1.089351,-0.387986 -1.558483,-0.721442c-1.84119,-1.308726 0.203394,-4.563713 -1.013934,-6.483656a3.893455,3.959616 0 0 0 -1.383282,-1.173577c-8.827131,-5.238061 -19.622031,-5.252448 -29.841113,-5.120501c-1.422614,0.018363 -3.403175,0.736933 -3.001921,2.1251c-1.931275,-1.409832 -4.460182,0.569811 -6.016872,2.397119l-3.186171,3.74003a28.331209,28.812639 0 0 0 -3.893779,5.356583c-0.973318,1.892923 -1.1885,4.803097 0.748564,5.628344c-1.440162,-0.61353 -3.187131,8.061659 3.451951,6.634325c3.857454,-0.829325 7.638518,-6.046797 11.833809,-7.565345l0,0z"/>
    <path stroke="null" id="svg_957" fill="#ffb8b8" d="m649.396999,270.775141s4.756344,62.883038 -1.902518,64.817899s-30.440537,16.446336 -68.491201,12.576613c0,0 -37.099398,20.316059 -31.391789,0.967474s31.391789,-14.511475 31.391789,-14.511475s45.660791,-9.674307 47.563323,-16.446336s-5.707595,-34.827534 -2.853798,-35.794964s25.684193,-11.609211 25.684193,-11.609211l0,0z"/>
    <path stroke="null" id="svg_958" fill="#575a89" d="m628.469135,245.621929l15.220268,-1.934861s15.220268,29.990366 6.658875,34.827534s-30.440537,8.706876 -30.440537,6.772015s8.561407,-39.664687 8.561407,-39.664687l0,0l-0.000014,0z"/>
   </g>
   <ellipse stroke="null" transform="matrix(0.6375586114013411,0,0,0.6483926033062267,-5119.936485861221,-767.25062549191) " id="svg_815" opacity="0.1" fill="#f9a826" ry="33.36" rx="176.1" cy="2052.021897" cx="8737.33981"/>
   <path stroke="null" id="svg_817" fill="url(#svg_813)" d="m566.021489,317.180744l-19.528431,-13.389298l0,0l9.850284,-14.913029l-51.578486,-4.182145l-18.533838,14.575869l-23.20076,-13.2272l-19.349898,2.366624l-0.229526,-5.187135a143.947984,146.394083 0 0 0 -1.600271,-16.144984c0.082885,-1.620975 0.14026,-3.481866 0.133892,-5.50484c0,-8.526372 -1.134853,-19.827857 -6.120567,-27.362175l1.147601,-10.490997l-9.308347,-11.184771a70.367346,71.563094 0 0 1 5.100463,-8.727365c0.318778,-0.466838 0.637556,-0.920711 0.981845,-1.361619c12.08173,-0.888306 21.613237,-10.990254 21.613237,-23.342128c0,-0.570586 0,-1.141172 -0.063756,-1.705283c0,-0.226937 -0.044626,-0.460348 -0.070137,-0.687299c1.179493,0.648404 2.37172,1.296794 3.563961,1.945185c0.223145,0.324195 0.478167,0.64839 0.758686,1.030949l0,0l0.057389,0.071314l0.357023,0.447398l0.114763,0.136153c0.127511,0.155622 0.261404,0.304755 0.395282,0.460363l0.089266,0.103748c0.337908,0.382544 0.694945,0.771578 1.077478,1.154137a1.147601,1.167102 0 0 1 0.127511,0.123188l0.478167,0.453873l0.133878,0.123203c0.408044,0.369579 0.841585,0.726194 1.275126,1.063354l0.14026,0.103748l0.548304,0.382544l0.178504,0.116713c0.210396,0.129678 0.427174,0.265846 0.63757,0.389034l0.076504,0.045399c0.248641,0.136153 0.503664,0.265831 0.758686,0.389034l0.127511,0.05186q0.325159,0.142657 0.63757,0.272335l0.197634,0.071314c0.223145,0.077818 0.439922,0.149133 0.669448,0.213972l0.14026,0.038909c0.280519,0.071314 0.561052,0.129678 0.847952,0.175062l0.031878,0a6.936641,7.054515 0 0 0 0.816075,0.084294l0.184886,0a7.013145,7.132319 0 0 0 0.73319,0l0.159389,0a7.555068,7.683451 0 0 0 0.911722,-0.110223a10.06068,10.231641 0 0 0 4.016618,-1.465367a3.506573,3.56616 0 0 0 0.816075,-0.771593c1.275112,-1.698793 -0.127511,-3.55967 -0.127511,-3.55967l0,0c-0.497297,-1.206011 -3.72335,-2.055408 -3.72335,-2.055408s-10.20094,-4.331263 -10.20094,-7.780709s-2.550224,-21.345084 -28.875023,-25.436445c0,0 -17.124819,-0.979075 -21.938396,8.344806l-0.102001,1.089313c-1.415386,0.901256 -2.588498,2.710273 -3.98474,3.24195a6.509468,6.620083 0 0 0 -1.727797,0.648404l0,-0.123203l0,0a1.644898,1.672849 0 0 0 -0.388901,0.512237a5.100463,5.187135 0 0 0 -0.529174,1.94517a7.204412,7.326836 0 0 1 -0.835204,2.353673a5.145103,5.232534 0 0 1 -0.382534,0.596516l0,0l-0.108382,0.175062a4.654174,4.733262 0 0 0 2.167691,-0.356615a10.79387,10.977289 0 0 1 -0.637556,2.593575a2.116698,2.152666 0 0 0 1.963676,-1.193046l0,-0.051874l0.082885,-0.116699a5.380996,5.472435 0 0 0 0.395296,-0.94018l-0.070137,0.077804c0.127511,-0.421454 0.242274,-0.849382 0.382534,-1.264361a1.950927,1.984079 0 0 1 0.312411,-0.64839a1.542897,1.569115 0 0 1 1.319738,-0.447398l-0.261404,5.621568l0.114763,0a7.54232,7.670486 0 0 1 -0.561052,1.180081c-0.905327,1.491297 -2.550224,2.509281 -3.155917,4.143221a5.993056,6.094895 0 0 0 -0.293267,2.450932c0,0.486293 0.057374,0.979075 0.095633,1.465367l0,-0.038909c0.089252,1.29678 0.114749,2.528736 -0.573815,3.572649c-0.471786,0.713229 -1.230486,1.251396 -1.491876,2.061883a1.976438,2.010024 0 0 0 -0.095633,0.700264a7.733587,7.865003 0 0 0 0.433541,2.081338a0.089252,0.090769 0 0 0 0,-0.038895a3.111291,3.164161 0 0 1 0.108382,1.530206c-0.2869,1.29678 -1.836179,2.379603 -1.75966,3.618019a1.370746,1.394039 0 0 0 0.070123,0.479817a2.582116,2.625994 0 0 0 1.440882,1.29678a5.610522,5.705861 0 0 0 3.238802,0.726208a4.258892,4.331263 0 0 0 1.211357,-0.421454c-0.446289,1.043899 -0.905327,2.074848 -1.370746,3.053923c-0.070137,0.155608 -0.146641,0.31123 -0.223145,0.466838c0,0 -3.940114,-2.677854 -6.177941,2.781602a11.909593,12.111972 0 0 0 -1.383508,3.656943a8.556042,8.701435 0 0 1 -0.471786,1.504262a9.518758,9.680509 0 0 1 -4.258892,3.890369c-4.564921,2.126722 -23.003126,25.514249 -23.328271,31.570235a34.740567,35.330912 0 0 1 -1.173112,6.989662a40.899379,41.59438 0 0 0 -1.096608,16.527528a31.093735,31.622109 0 0 0 1.128486,5.271428c1.957309,6.049511 3.264299,17.33803 3.264299,17.33803l2.116698,19.594416a54.830036,55.76176 0 0 0 0.344275,8.098429c-2.161324,2.509281 -10.838496,12.967844 -7.52319,15.814299c2.550239,2.243435 7.013145,1.873842 9.518758,1.413493c-2.110316,5.310337 -5.432003,14.543449 -5.871911,20.884721c-0.63757,9.382244 1.090212,21.811922 3.825351,26.584093s11.852205,17.013821 11.852205,17.013821s-0.42716,16.793374 2.830772,22.894745s4.571289,18.757999 4.571289,18.757999s3.041154,10.685514 1.517386,14.614778s2.82439,7.197158 -1.740531,9.810173s-10.404955,61.50653 -10.404955,61.50653s-2.35259,38.598806 0,40.563431a2.390849,2.431477 0 0 0 0.401663,0.239916l0,12.967844s-1.632149,2.723253 5.00483,3.274384c4.545792,0.369594 17.430849,1.206011 25.075183,1.692304l5.922919,0.376069s14.026291,2.839966 20.223361,0s17.182208,-2.775112 15.550058,-10.277025a20.988429,21.345084 0 0 0 -0.867082,-3.002049c-1.791538,-4.655458 -4.832692,-5.187149 -10.436833,-6.483929c-0.325159,-0.071329 -0.63757,-0.136168 -0.92447,-0.188027c-5.903789,-1.043914 -7.841968,1.750653 -11.150893,-1.886835c-2.875398,-3.144692 -12.030737,-6.665467 -15.148395,-7.780709c0.076504,-0.233412 0.172137,-0.460348 0.248655,-0.700264a4.666922,4.746227 0 0 1 -2.365353,-1.173592l8.447661,0.544656l5.030326,0.317705s11.922356,2.418512 17.214085,0s14.600091,-2.353659 13.210216,-8.727365a17.985534,18.291161 0 0 0 -0.73319,-2.554665c-1.523768,-3.955194 -4.112251,-4.389612 -8.87482,-5.4854c-0.274152,-0.058349 -0.529174,-0.116713 -0.784197,-0.162098c-5.017578,-0.888291 -6.662489,1.484822 -9.474118,-1.601521c-2.409965,-2.632484 -10.01604,-5.582658 -12.751178,-6.587677c0,-1.439423 -1.912668,-3.488356 -3.117658,-5.543749c-1.415372,-2.399058 1.198608,-10.795737 1.198608,-10.795737l1.49189,-34.838144a6.617863,6.73032 0 0 1 1.785171,-0.518712s6.74536,-6.548768 5.221593,-13.525465a44.074425,44.823379 0 0 1 -0.484534,-6.373706c2.218698,-2.094303 5.2726,-5.187135 6.139682,-7.09341c1.415386,-3.105797 0,-18.154993 0,-18.154993l0,-57.544847l11.284785,1.160627l10.239199,1.069844l3.117658,0.324195l10.239199,1.050403l23.532286,2.418498l21.205192,-4.084872l9.174469,-1.763618l18.865364,-3.630999l0,-46.943626l19.528417,-3.280874l0,0l0.000014,0zm-155.315654,-155.555866l-1.313371,-0.142643c0.433541,0.019455 0.892579,0.103748 1.313371,0.142643z"/>
   <path stroke="null" id="svg_818" fill="#efb7b9" d="m520.251145,347.661681c-6.375589,9.27851 -29.295816,4.363682 -29.295816,4.363682l-17.762389,-16.903583l-2.390835,-2.288834l4.010236,-8.662526s1.275126,0.356615 3.461947,0.99204c11.482433,3.391097 47.357854,14.699057 41.976857,22.499221l0,0z"/>
   <path stroke="null" id="svg_819" opacity="0.1" d="m478.261539,325.16246c-0.784197,2.775127 -2.932772,6.931313 -5.068585,9.959306l-2.390849,-2.28882l4.010236,-8.662526s1.287875,0.356615 3.449198,0.99204z"/>
   <path stroke="null" id="svg_820" fill="#dce6f2" d="m417.342814,227.475636s-16.3725,7.385186 -15.569174,25.520724a294.003772,298.999759 0 0 0 3.748833,34.857598s-3.347184,27.290846 10.589855,34.325893s26.834844,12.818726 26.834844,12.818726s21.804503,2.386093 24.514131,3.371643s11.176404,-14.083086 9.614377,-16.43027s-21.574978,-7.268473 -24.125216,-11.184771s-8.447647,-6.334797 -8.447647,-6.334797s-6.088689,-3.747712 -6.5031,-7.132319s1.192227,-5.906853 1.600271,-7.391675s1.440882,-15.820775 1.440882,-15.820775s6.872886,-51.028498 -23.698056,-46.599977z"/>
   <path stroke="null" id="svg_821" opacity="0.1" d="m428.149432,287.108296s-22.461189,3.825516 -20.287117,11.820197c0,0 8.154379,-8.630106 20.287117,-11.820197z"/>
   <path stroke="null" id="svg_822" opacity="0.1" d="m428.321569,290.343785s-12.349501,10.251081 -9.933155,10.776283s9.933155,-10.776283 9.933155,-10.776283z"/>
   <path stroke="null" id="svg_823" opacity="0.1" d="m434.25725,293.91642s-3.308939,6.892418 -1.275126,6.42558s1.275126,-6.42558 1.275126,-6.42558z"/>
   <path stroke="null" id="svg_824" opacity="0.1" d="m479.090362,325.895144l-1.364379,-0.395509c0.388915,-1.296794 0.497297,-2.347183 0.178519,-2.833476c-1.562012,-2.347183 -21.562229,-7.261997 -24.106087,-11.184786s-8.447661,-6.334782 -8.447661,-6.334782s-6.088675,-3.747712 -6.503086,-7.132334s1.192227,-5.906853 1.600271,-7.391661s1.440882,-15.827264 1.440882,-15.827264s6.853756,-51.022023 -23.717186,-46.593501c0,0 -16.3725,7.391675 -15.575555,25.527214a293.181331,298.163342 0 0 0 3.755214,34.857598s-3.347184,27.290832 10.589855,34.325893s26.834844,12.818726 26.834844,12.818726s21.798122,2.379603 24.514131,3.371643c1.026471,0.376069 2.881765,-1.562626 4.6988,-4.227515l1.032852,0.97906l17.762375,16.897122s22.920241,4.921289 29.295816,-4.357207c5.387377,-7.806639 -30.481676,-19.114613 -41.989606,-22.499221l0,0z"/>
   <path stroke="null" id="svg_825" fill="#965d7b" d="m407.919703,159.407373a5.419241,5.51133 0 0 0 -1.766042,0.693789c-0.637556,0.538167 -0.637556,1.458878 -0.796945,2.26289a7.319175,7.443549 0 0 1 -1.275126,3.099307a4.584051,4.661947 0 0 0 2.123079,-0.356615a10.927748,11.113443 0 0 1 -0.637556,2.593575a2.06569,2.100792 0 0 0 1.912668,-1.186557a12.279379,12.488041 0 0 0 0.796945,-2.275855a1.842546,1.873856 0 0 1 0.30603,-0.64839c0.586563,-0.706754 1.676775,-0.389048 2.582116,-0.298265a4.239762,4.311808 0 0 0 3.876358,-1.89331c0.962715,-1.484822 1.02009,-5.284393 -1.275126,-5.686407c-2.397217,-0.401999 -3.889106,2.956679 -5.846401,3.695838l0,0z"/>
   <g stroke="null" transform="matrix(0.6375586114013411,0,0,0.6483926033062267,-5119.936485861221,-767.25062549191) " id="svg_826" opacity="0.1">
    <path stroke="null" id="svg_827" d="m8667.479694,1431.461975c0.09,-0.49 0.15,-1 0.26,-1.49l0,0c-0.95,0.83 -1,2.24 -1.25,3.49a11,11 0 0 1 -0.59,2.11a11.46,11.46 0 0 0 1.58,-4.11z"/>
    <path stroke="null" id="svg_828" d="m8667.799694,1439.721975a16.63,16.63 0 0 0 1,-4a7.16,7.16 0 0 1 -3.17,0.55a11.57,11.57 0 0 1 -1.15,2a7.12,7.12 0 0 0 3.32,-0.54a16.63,16.63 0 0 1 -1,4a3.25,3.25 0 0 0 3,-1.83a7.46,7.46 0 0 0 0.6,-1.43a3,3 0 0 1 -2.6,1.25z"/>
    <path stroke="null" id="svg_829" d="m8676.579694,1432.921975c-1.42,-0.14 -3.14,-0.63 -4.06,0.46a3.09,3.09 0 0 0 -0.48,1c-0.09,0.26 -0.17,0.53 -0.24,0.8c0.95,-0.75 2.49,-0.35 3.78,-0.22a6.68,6.68 0 0 0 6.08,-2.92a5.54,5.54 0 0 0 0.67,-1.57a6.66,6.66 0 0 1 -5.75,2.45z"/>
   </g>
   <polygon stroke="null" id="svg_830" fill="#dce6f2" points="427.11041259765625,212.9582977294922 436.8329772949219,224.84971618652344 435.5649108886719,236.85125732421875 423.8143005371094,218.14523315429688 427.11041259765625,212.9582977294922 "/>
   <polygon stroke="null" id="svg_831" opacity="0.1" points="436.82720947265625,224.84971618652344 435.6341857910156,236.13804626464844 435.5578918457031,236.85125732421875 424.9556884765625,219.96728515625 423.8143005371094,218.14523315429688 424.14544677734375,217.62010192871094 427.1045837402344,212.9582977294922 427.760986328125,213.76223754882812 436.82720947265625,224.84971618652344 "/>
   <path stroke="null" id="svg_832" fill="#efb7b9" d="m441.876074,196.858532c-3.289809,0.95962 -6.432978,4.253459 -9.168102,8.254037a69.270739,70.447852 0 0 0 -4.947455,8.649561c-0.89896,1.828471 -1.689524,3.585614 -2.346209,5.11582l-0.459052,1.089298c-1.109342,2.664889 -1.727783,4.447976 -1.727783,4.447976s-25.183565,-19.257271 -21.198825,-20.554051c1.338882,-0.434418 3.098542,-3.352188 4.839073,-7.028571l0.216778,-0.466838c1.102975,-2.360148 2.18682,-4.992632 3.149536,-7.469494c1.970057,-5.089876 3.430069,-9.511908 3.430069,-9.511908s38.253507,14.556414 28.21197,17.474169l0,0z"/>
   <path stroke="null" id="svg_833" fill="#444053" d="m456.941584,178.30154s5.814537,10.698479 13.624628,9.239587s4.596799,-5.744756 4.596799,-5.744756l-18.221427,-3.494831l0,0z"/>
   <path stroke="null" id="svg_834" fill="#a36468" d="m445.675914,548.630967c-5.15147,2.392582 -16.79966,0 -16.79966,0l-4.90921,-0.311216c-6.375589,-0.414978 -17.048315,-1.115242 -20.822658,-1.426472c-5.508507,-0.460348 -4.156891,-2.755672 -4.156891,-2.755672l0,-13.869115l26.726462,-6.885928s10.564344,3.676383 13.458857,6.885928c2.747887,3.060413 4.354525,0.706754 9.257354,1.58857c0.242274,0.045384 0.497297,0.097259 0.765067,0.162098c4.654188,1.082809 7.178916,1.510752 8.670805,5.433526a17.915397,18.219832 0 0 1 0.720441,2.528736c1.377127,6.315342 -7.765464,6.269958 -12.910568,8.649546l0,0.000014l0,-0.000014z"/>
   <path stroke="null" id="svg_835" opacity="0.1" d="m457.86604,537.452685a19.981087,20.320625 0 0 1 -3.009276,1.569115c-3.506573,1.627465 -6.841008,3.611544 -10.385826,5.148226s-7.363815,2.632484 -11.201914,2.340708c-2.008302,-0.149133 -4.061244,-0.64839 -5.980293,-0.064839a13.809527,14.044192 0 0 0 -3.321687,1.873856c-6.375589,-0.414978 -17.048315,-1.115242 -20.822658,-1.426472c-5.508507,-0.460348 -4.156891,-2.755672 -4.156891,-2.755672l0,-1.620975c0.197648,0 0.420793,-0.058349 0.675815,-0.077804a12.037104,12.24165 0 0 1 3.889106,0.590041c2.767016,0.765103 5.521256,1.517227 8.288272,2.269365a6.547727,6.658992 0 0 1 3.187795,-4.136746a10.162681,10.335375 0 0 1 5.138722,-1.199522c4.290769,0.058349 8.352013,2.126722 12.636401,2.334219a6.962138,7.080445 0 0 0 3.500206,-0.59653c0.586549,-0.298251 1.102975,-0.732684 1.676775,-1.063368a12.241119,12.449132 0 0 1 2.888146,-0.99204a63.602842,64.683641 0 0 0 8.25638,-2.710273c0.765067,-0.30474 1.657646,-0.855872 1.555645,-1.685828c-0.133892,-1.102263 -1.836179,-1.231941 -2.282468,-2.243435a1.275112,1.29678 0 0 1 0.051007,-1.147648c0.242274,0.045384 0.497297,0.097259 0.765067,0.162098c4.635058,1.082809 7.159786,1.510752 8.651676,5.433526l0,0z"/>
   <path stroke="null" id="svg_836" fill="#a36468" d="m440.231162,578.97575c-6.056797,2.814021 -19.76431,0 -19.76431,0l-5.769911,-0.34365c-7.472183,-0.486293 -20.057591,-1.296794 -24.501368,-1.679339c-6.483971,-0.544642 -4.890081,-3.241965 -4.890081,-3.241965l0,-16.345976l31.450772,-8.104904s12.432386,4.324773 15.836958,8.104904c3.232421,3.598579 5.100463,0.829942 10.89587,1.867366c0.2869,0.051874 0.586549,0.116713 0.89896,0.188042c5.476629,1.29678 8.447647,1.783073 10.20094,6.399636a20.465636,20.813407 0 0 1 0.847952,2.976119c1.581142,7.430584 -9.148972,7.372221 -15.205784,10.179767z"/>
   <path stroke="null" id="svg_837" opacity="0.1" d="m454.576231,565.819865a23.736301,24.139651 0 0 1 -3.53845,1.847912c-4.124999,1.912765 -8.052365,4.246969 -12.22199,6.055986s-8.664424,3.092832 -13.184719,2.755672c-2.358958,-0.175062 -4.775304,-0.778068 -7.013145,-0.077804a16.257751,16.534018 0 0 0 -3.920984,2.23047c-7.472183,-0.486293 -20.057591,-1.29678 -24.501368,-1.679339c-6.483971,-0.544642 -4.890081,-3.241965 -4.890081,-3.241965l0,-1.906275a7.969479,8.104904 0 0 1 0.796945,-0.090769a13.988032,14.225729 0 0 1 4.57767,0.693774l9.748269,2.671378a7.714457,7.845548 0 0 1 3.780725,-4.869429a11.896845,12.099007 0 0 1 6.05043,-1.413493c5.04947,0.071329 9.824788,2.502791 14.867876,2.749182a8.230883,8.37075 0 0 0 4.10587,-0.693774c0.694945,-0.356615 1.275126,-0.868851 1.976438,-1.251396a13.866902,14.102541 0 0 1 3.398177,-1.167116a76.309395,77.606115 0 0 0 9.665398,-3.190091c0.89896,-0.36309 1.950927,-1.011494 1.829783,-1.984079c-0.159389,-1.29678 -2.161324,-1.452402 -2.690498,-2.645434a1.536516,1.562626 0 0 1 0.063756,-1.348654c0.286914,0.05186 0.586563,0.116699 0.89896,0.188027c5.476629,1.24492 8.447661,1.750667 10.20094,6.367216l0,0z"/>
   <path stroke="null" id="svg_838" fill="#444053" d="m426.523664,466.810316l-1.702286,40.738508s-2.550239,8.318876 -1.16673,10.698479s3.716969,4.752716 2.869017,6.15972s-11.048892,16.618312 -14.345069,10.782772s-6.547727,-31.122837 -6.547727,-31.122837l3.041154,-31.233075l17.851641,-6.023567z"/>
   <path stroke="null" id="svg_839" fill="#444053" d="m433.90658,365.310927l4.730692,6.432055l0,55.943326s1.383494,14.913029 0,17.992881s-8.396653,9.239601 -8.396653,9.239601l-5.897408,-30.798657l1.275112,-32.581715l8.288258,-26.227492l0,0z"/>
   <path stroke="null" id="svg_840" opacity="0.1" d="m426.523664,466.810316l-1.702286,40.738508s-2.550239,8.318876 -1.16673,10.698479s3.716969,4.752716 2.869017,6.15972s-11.048892,16.618312 -14.345069,10.782772s-6.547727,-31.122837 -6.547727,-31.122837l3.041154,-31.233075l17.851641,-6.023567z"/>
   <path stroke="null" id="svg_841" opacity="0.1" d="m433.90658,365.310927l4.730692,6.432055l0,55.943326s1.383494,14.913029 0,17.992881s-8.396653,9.239601 -8.396653,9.239601l-5.897408,-30.798657l1.275112,-32.581715l8.288258,-26.227492l0,0z"/>
   <path stroke="null" id="svg_842" fill="#444053" d="m438.637272,341.450087l0,30.260476l-5.310859,23.556114s-1.702286,56.844568 -0.216778,63.756441s-5.100463,13.402277 -5.100463,13.402277s-3.825351,0.434418 -3.825351,3.455936s-6.375589,11.671064 -6.375589,11.671064l0.210396,16.858199s2.767002,31.55727 -1.485509,37.606781s1.485509,6.918348 1.485509,6.918348c-5.310859,17.720575 -30.813216,13.616234 -33.114799,11.671064s0,-40.200341 0,-40.200341s5.699774,-58.355334 10.162681,-60.948909s0.216778,-5.835525 1.702286,-9.725879s-1.485509,-14.47861 -1.485509,-14.47861s-1.275112,-12.539915 -4.462907,-18.589412s-2.767002,-22.693752 -2.767002,-22.693752s-8.925828,-12.105482 -11.578067,-16.858199s-4.360906,-17.072185 -3.72335,-26.370135c0.433541,-6.282923 3.678724,-15.431741 5.738033,-20.696694c0.988212,-2.522246 1.702286,-4.156186 1.702286,-4.156186l0.605678,0.162098l34.823453,9.272006l23.01586,6.127315l0,0z"/>
   <path stroke="null" id="svg_843" opacity="0.1" d="m441.876074,196.858532c-3.289809,0.95962 -6.432978,4.253459 -9.168102,8.254037l-0.71406,0a22.7736,23.16059 0 0 1 -19.764324,-11.62568a22.429311,22.810451 0 0 1 -2.001935,-4.636003c1.970057,-5.089876 3.430069,-9.511922 3.430069,-9.511922s38.259888,14.601798 28.218352,17.519568z"/>
   <path stroke="null" id="svg_844" fill="#efb7b9" d="m454.786627,180.648723a22.792715,23.18003 0 1 1 -42.63991,-11.359834a22.269922,22.648353 0 0 1 2.409965,-3.54023a23.066867,23.458841 0 0 1 5.240737,-4.681402a22.792715,23.18003 0 0 1 34.957331,17.882672c0.012762,0.570586 0.031878,1.134683 0.031878,1.698793l0,0z"/>
   <path stroke="null" id="svg_845" opacity="0.1" d="m435.634377,236.138162l-0.076518,0.713229l-10.602589,-16.858213c-1.109356,2.664903 -1.727797,4.447976 -1.727797,4.447976s-25.183565,-19.2832 -21.198811,-20.579981c1.338868,-0.434418 3.098528,-3.352188 4.839059,-7.028571l0.216778,-0.466838c1.848913,5.602099 12.591775,16.799849 17.061063,21.28672c0.516426,0.518712 0.943586,0.946655 1.275126,1.257885l0.682182,0.64839l0.357037,0.363104c1.625768,1.705269 8.485906,9.226622 9.174469,16.216298l0,0z"/>
   <path stroke="null" id="svg_846" fill="#dce6f2" d="m443.559216,293.339359l-1.160349,37.976346l-0.204015,6.76274s-13.745772,-1.29678 -26.573454,-2.723253c-10.328437,-1.147648 -20.063958,-2.386078 -21.562229,-3.112287c-1.912668,-0.914221 -6.012171,-1.620975 -9.244592,-2.068373c-2.499231,-0.343635 -4.462921,-0.525187 -4.462921,-0.525187s-0.73319,0.220447 -1.861661,0.427929c-2.460986,0.453887 -6.78362,0.823467 -9.30198,-1.400528c-3.219672,-2.846441 5.240722,-13.188305 7.351053,-15.671642l0.465419,-0.538167l-0.796959,-7.488934l-2.072057,-19.419354s-1.275126,-11.184771 -3.187795,-17.182408a31.163858,31.693423 0 0 1 -1.102975,-5.219554a41.109776,41.808351 0 0 1 1.071097,-16.37841a35.116734,35.71347 0 0 0 1.147601,-6.931313c0.318778,-5.997622 18.329808,-29.177667 22.792729,-31.284935a9.461369,9.622146 0 0 0 4.564921,-4.629528a8.696302,8.844078 0 0 0 0.694931,-2.016499c1.912682,-8.429114 6.751742,-5.083401 6.751742,-5.083401c1.166745,6.594153 19.228768,24.048882 19.228768,24.048882l0.357037,0.363104c1.791538,1.867366 9.77378,10.633626 9.206347,18.116084a21.594107,21.961054 0 0 0 1.20499,8.195688a136.278153,138.593919 0 0 1 6.279956,36.309986l0.414411,9.473013l-0.000014,0z"/>
   <path stroke="null" id="svg_847" opacity="0.1" d="m417.967621,248.243644s-4.462907,11.022674 -7.81009,12.805761s9.403981,3.760677 7.81009,-12.805761z"/>
   <path stroke="null" id="svg_848" opacity="0.1" d="m421.314805,268.830114s-10.20094,1.29678 -10.20094,3.241965s10.20094,-3.241965 10.20094,-3.241965z"/>
   <path stroke="null" id="svg_849" opacity="0.1" d="m431.993912,281.473763s-14.823236,32.095437 -18.967365,33.068036s18.967365,-33.068036 18.967365,-33.068036z"/>
   <path stroke="null" id="svg_850" opacity="0.1" d="m425.815971,222.508948l-12.260249,5.420561l-14.797739,-22.732647a8.696302,8.844078 0 0 0 0.694945,-2.016499c1.912668,-8.429099 6.751742,-5.083401 6.751742,-5.083401c1.16673,6.594153 19.228768,24.048882 19.228768,24.048882l0.382534,0.363104l0,0z"/>
   <path stroke="null" id="svg_851" fill="#dce6f2" d="m426.453527,221.212168l-12.260249,5.420561l-14.797739,-22.732647a8.696302,8.844078 0 0 0 0.694945,-2.016499c1.912668,-8.429114 6.751742,-5.083401 6.751742,-5.083401c1.16673,6.594153 19.228768,24.048882 19.228768,24.048882l0.382534,0.363104l0,0z"/>
   <path stroke="null" id="svg_852" opacity="0.1" d="m442.194852,338.078445s-13.745772,-1.29678 -26.573454,-2.723253l23.015874,6.127315l0,7.132319c-1.007341,0.927201 -1.880805,1.407018 -2.448224,1.160627c-2.652239,-1.134697 -24.297367,-4.700857 -24.297367,-4.700857s-12.572646,-6.483915 -26.139899,-14.264624a10.475092,10.653094 0 0 1 -0.956334,-0.609495a15.071891,15.328007 0 0 1 -4.016618,-4.091361c-2.505612,-3.689348 -3.729717,-8.429099 -4.258892,-13.078082a55.607866,56.552807 0 0 1 -0.33154,-8.0271a64.71858,65.818338 0 0 1 0.816075,-9.071a293.327971,298.312474 0 0 1 -1.912668,-35.013206c0.159389,-18.154993 16.895307,-24.638922 16.895307,-24.638922c30.762195,-2.755672 21.224322,47.818953 21.224322,47.818953s-1.77879,14.264639 -2.263338,15.723531s-2.225079,3.890355 -1.989186,7.294417s6.1142,7.475955 6.1142,7.475955s5.738019,2.736217 8.103358,6.788684c1.721416,2.989084 12.904186,7.041536 19.222401,9.933361l-0.204015,6.76274l0,0z"/>
   <path stroke="null" id="svg_853" opacity="0.1" d="m452.497793,166.254407a7.21716,7.339801 0 0 1 -0.637556,3.099307a18.839853,19.159998 0 0 1 -1.134853,2.308289a10.455962,10.63364 0 0 1 -2.792513,3.52725c-1.47276,1.069844 -3.334421,1.368109 -5.100463,1.802527s-3.602206,1.128207 -4.609548,2.658414a9.142591,9.297951 0 0 0 -1.077478,3.177126a6.719864,6.834054 0 0 1 -1.275112,3.073377a2.505612,2.54819 0 0 1 -2.983779,0.726208a3.015657,3.066902 0 0 1 -1.153982,-1.510766c-0.726808,-1.66636 -0.911708,-3.514286 -1.20499,-5.310323s-0.707679,-3.643978 -1.791538,-5.089891s-3.002895,-2.399058 -4.705181,-1.834947a4.533044,4.610073 0 0 0 -2.550224,2.515756a14.179299,14.420246 0 0 0 -0.962715,3.579139q-1.18586,6.600628 -2.798894,13.123466a1.18586,1.206011 0 0 1 -0.210382,0.492768a0.918089,0.93369 0 0 1 -0.63757,0.272335c-1.42812,0.194517 -2.79888,-0.823467 -4.239762,-0.713243a2.435476,2.476861 0 0 0 -0.439908,0.071329a22.779967,23.167066 0 0 1 2.301583,-26.454415l0.114763,-0.03242a6.872886,6.989676 0 0 0 2.550224,-1.633954a26.917729,27.37514 0 0 0 2.550239,-3.002063l0.510045,-0.64839a29.079052,29.573191 0 0 1 4.972966,-4.80459a5.100463,5.187135 0 0 1 1.695905,-0.933676a5.023959,5.109331 0 0 1 1.606639,-0.051874a40.529594,41.218311 0 0 0 6.636993,0.252866a42.582536,43.306138 0 0 1 4.660555,-0.479803c4.035747,0.116713 7.478564,3.015028 10.028789,6.192154c1.37076,1.627465 2.594865,3.501321 2.67775,5.628043l0,0z"/>
   <path stroke="null" id="svg_854" fill="#965d7b" d="m409.169319,169.90486c-0.886211,1.478332 -2.486483,2.483337 -3.085794,4.104326c-0.87983,2.353659 0.605678,5.284393 -0.758686,7.385186c-0.45267,0.706754 -1.198622,1.231941 -1.453645,2.042429c-0.433541,1.368109 0.752319,2.827001 0.446289,4.234004s-2.129446,2.593575 -1.644898,3.968173a2.550239,2.593575 0 0 0 1.402638,1.29678a5.482997,5.576169 0 0 0 3.187781,0.719719c1.740545,-0.291776 3.034787,-2.029464 4.800828,-2.159142c1.434501,-0.103748 2.805247,0.907746 4.233381,0.719704a0.956334,0.972585 0 0 0 0.637556,-0.278796a1.102975,1.121718 0 0 0 0.210396,-0.492782q1.606653,-6.516349 2.805261,-13.123466a13.898779,14.134961 0 0 1 0.956334,-3.579125a4.571303,4.648983 0 0 1 2.550239,-2.515771c1.702286,-0.557621 3.614954,0.389034 4.705181,1.834947s1.504638,3.293839 1.797919,5.089891s0.478167,3.643964 1.198608,5.310337a3.047535,3.099322 0 0 0 1.160349,1.517241c0.956348,0.564096 2.244209,0.116699 2.977398,-0.726208a6.649741,6.76274 0 0 0 1.275126,-3.079867a9.104332,9.259042 0 0 1 1.077478,-3.170636c1.007341,-1.530206 2.849887,-2.223981 4.609548,-2.658414s3.614954,-0.739159 5.100463,-1.809017a10.494221,10.672549 0 0 0 2.792513,-3.520761c0.943586,-1.672864 1.823416,-3.488356 1.746912,-5.414086c-0.082885,-2.100792 -1.307004,-3.974648 -2.613994,-5.608588c-2.550239,-3.177126 -5.999423,-6.075441 -10.03517,-6.185664a39.656145,40.330019 0 0 0 -4.660555,0.479803a39.892038,40.56992 0 0 1 -6.636993,-0.259356a5.215226,5.303848 0 0 0 -1.606639,0.058349a4.807196,4.888884 0 0 0 -1.689538,0.93369a29.091801,29.586156 0 0 0 -4.979333,4.798101a36.538487,37.159383 0 0 1 -3.073032,3.630999a6.917512,7.035061 0 0 1 -2.550239,1.64043c-0.637556,0.181552 -1.275112,0.051874 -1.88079,0.252881c-1.880805,0.603006 -2.129446,3.099322 -3.002909,4.564689l0,0l0.000014,0z"/>
   <path stroke="null" id="svg_855" opacity="0.1" d="m470.566211,187.534651c-5.100477,0.953131 -9.327491,-3.241965 -11.667333,-6.302377a25.005046,25.429955 0 0 1 -1.957294,-2.930735l17.507353,3.358678l0.707693,0.136153s3.219672,4.285878 -4.590418,5.738281z"/>
   <g stroke="null" transform="matrix(0.6375586114013411,0,0,0.6483926033062267,-5119.936485861221,-767.25062549191) " id="svg_856" opacity="0.1">
    <path stroke="null" id="svg_857" d="m8664.699694,1469.891975a8.33,8.33 0 0 0 -0.58,-3.84c0,0.1 -0.09,0.2 -0.12,0.3c-0.43,1.34 0.15,2.73 0.52,4.12a3,3 0 0 0 0.18,-0.58z"/>
    <path stroke="null" id="svg_858" d="m8667.079694,1453.521975a22.22,22.22 0 0 0 0.08,4.15a22.28,22.28 0 0 0 -0.08,-4.15z"/>
    <path stroke="null" id="svg_859" d="m8736.529694,1444.171975a16.4,16.4 0 0 1 -4.38,5.44c-2.31,1.65 -5.22,2.11 -8,2.78s-5.65,1.74 -7.23,4.1a14.41,14.41 0 0 0 -1.69,4.9a10.47,10.47 0 0 1 -2,4.75c-1.15,1.3 -3.17,2 -4.67,1.12a4.78,4.78 0 0 1 -1.82,-2.34c-1.13,-2.57 -1.43,-5.41 -1.88,-8.19s-1.12,-5.62 -2.82,-7.85s-4.71,-3.7 -7.38,-2.83a7.14,7.14 0 0 0 -4,3.88a21.8,21.8 0 0 0 -1.5,5.52q-1.87,10.19 -4.4,20.24a1.73,1.73 0 0 1 -0.33,0.76a1.5,1.5 0 0 1 -1,0.43c-2.24,0.29 -4.39,-1.27 -6.64,-1.11c-2.77,0.2 -4.8,2.88 -7.53,3.32a8.45,8.45 0 0 1 -5,-1.11a5.35,5.35 0 0 1 -1.83,-1.3a2.7,2.7 0 0 0 -0.37,2.33a3.9,3.9 0 0 0 2.2,2a8.45,8.45 0 0 0 5,1.11c2.73,-0.44 4.76,-3.12 7.53,-3.32c2.25,-0.16 4.4,1.4 6.64,1.11a1.5,1.5 0 0 0 1,-0.43a1.73,1.73 0 0 0 0.33,-0.76q2.52,-10 4.4,-20.24a21.8,21.8 0 0 1 1.5,-5.52a7.14,7.14 0 0 1 4,-3.88c2.67,-0.87 5.67,0.6 7.38,2.83s2.36,5.08 2.82,7.85s0.75,5.62 1.88,8.19a4.78,4.78 0 0 0 1.82,2.34c1.5,0.87 3.52,0.18 4.67,-1.12a10.47,10.47 0 0 0 2,-4.75a14.41,14.41 0 0 1 1.69,-4.9c1.58,-2.36 4.47,-3.42 7.23,-4.1s5.67,-1.13 8,-2.78a16.4,16.4 0 0 0 4.38,-5.44c1.48,-2.57 2.86,-5.37 2.74,-8.34a10.74,10.74 0 0 0 -0.12,-1.14a19.65,19.65 0 0 1 -2.62,6.45z"/>
   </g>
   <path stroke="null" id="svg_860" opacity="0.1" d="m451.885733,169.334274a22.524945,22.907709 0 0 1 2.837139,9.628621c-5.680645,-3.241965 -11.023382,-6.801635 -13.720261,-8.040065c-4.6988,-2.159142 -22.269922,-1.834947 -28.875023,-1.633954a22.269922,22.648353 0 0 1 2.409965,-3.540215a23.066867,23.458841 0 0 1 5.259866,-4.681402a22.805478,23.19301 0 0 1 32.120206,8.254037l-0.031878,0.012979l-0.000014,0z"/>
   <path stroke="null" id="svg_861" opacity="0.1" d="m472.160102,184.785469c-3.06665,0.95962 -8.071494,-0.894781 -13.261223,-3.553195a25.005046,25.429955 0 0 1 -1.957294,-2.930735l17.507353,3.358678c1.160363,0.803998 1.453631,1.95166 -2.288835,3.125252l0,0z"/>
   <path stroke="null" id="svg_862" fill="#444053" d="m433.351909,146.854493s-16.735918,-0.972585 -21.441099,8.267016l-0.758686,8.189198l-1.275126,-0.142657l-0.255022,5.569694s25.578847,-1.134683 31.399765,1.536696s23.908453,16.132005 31.157491,13.862625s-0.637556,-4.376647 -0.637556,-4.376647s-9.977795,-4.298843 -9.977795,-7.670486s-2.473735,-21.182986 -28.21197,-25.235438l0,0z"/>
   <path stroke="null" id="svg_863" opacity="0.1" d="m401.072314,450.43192s10.679107,10.536367 15.301417,9.725879c0,0 -13.069957,-1.134683 -15.301417,-9.725879z"/>
   <path stroke="null" id="svg_864" opacity="0.1" d="m398.840868,455.314315s0.956334,5.420561 3.506573,4.88887s-3.506573,-4.88887 -3.506573,-4.88887z"/>
   <path stroke="null" id="svg_865" opacity="0.1" d="m415.576772,545.907729s-15.161143,11.995259 -12.604524,12.319454s12.604524,-12.319454 12.604524,-12.319454z"/>
   <polygon stroke="null" id="svg_866" fill="#f9a826" points="435.85736083984375,307.8373107910156 484.9496765136719,299.71295166015625 484.9496765136719,346.9809875488281 438.30548095703125,344.4974365234375 435.85736083984375,307.8373107910156 "/>
   <polygon stroke="null" id="svg_867" opacity="0.05" points="435.85736083984375,307.8373107910156 484.9496765136719,299.71295166015625 484.9496765136719,346.9809875488281 438.30548095703125,344.4974365234375 435.85736083984375,307.8373107910156 "/>
   <polygon stroke="null" id="svg_868" fill="#f9a826" points="484.9496765136719,299.71295166015625 543.822265625,304.193603515625 540.563720703125,345.3274230957031 484.9496765136719,346.9809875488281 484.9496765136719,299.71295166015625 "/>
   <polygon stroke="null" id="svg_869" opacity="0.1" points="484.9496765136719,299.71295166015625 543.822265625,304.193603515625 540.563720703125,345.3274230957031 484.9496765136719,346.9809875488281 484.9496765136719,299.71295166015625 "/>
   <polygon stroke="null" id="svg_870" fill="#f9a826" points="503.05059814453125,285.28631591796875 484.9496765136719,299.71295166015625 543.822265625,304.193603515625 553.44287109375,289.4295959472656 503.05059814453125,285.28631591796875 "/>
   <polygon stroke="null" id="svg_871" fill="#f9a826" points="418.0828552246094,292.0815124511719 462.2776794433594,286.60888671875 484.9496765136719,299.71295166015625 435.85736083984375,307.8373107910156 418.0828552246094,292.0815124511719 "/>
   <g stroke="null" transform="matrix(-1.1990604457114677,-0.7578838426483746,0.7452203616428421,-1.2194360016682029,861.5589293867698,1132.641255637209) " id="svg_983">
    <g stroke="null" transform="matrix(0.13055738671872294,0,0,0.13055738671872294,-780.9311823045139,-664.8542406785645) " id="svg_963">
     <title stroke="null" transform="translate(-49.66372299194336,43.42849349975586) translate(191.4594268798828,4.728227615356445) translate(365.9873352050781,168.13047790527344) translate(-1394.02294921875,980.4118041992188) ">background</title>
     <rect stroke="null" x="9458.007062" y="7239.549088" width="582" height="402" id="svg_962" fill="none"/>
    </g>
    <g stroke="null" transform="matrix(0.13055738671872294,0,0,0.13055738671872294,-780.9311823045139,-664.8542406785645) " id="svg_982">
     <title stroke="null" transform="translate(-49.66372299194336,43.42849349975586) translate(191.4594268798828,4.728227615356445) translate(365.9873352050781,168.13047790527344) translate(-1394.02294921875,980.4118041992188) ">Layer 1</title>
     <path stroke="null" d="m10298.91477,7621.117093l-208.72132,0l0,-4.30193l-94.64237,0l0,4.30193l-209.58169,0a14.11841,14.11841 0 0 0 -14.11843,14.11842l0,285.80365a14.11846,14.11846 0 0 0 14.11843,14.11848l512.94538,0a14.11846,14.11846 0 0 0 14.11843,-14.11848l0,-285.80365a14.11841,14.11841 0 0 0 -14.11843,-14.11842z" fill="#3f3d56" id="svg_965"/>
     <rect stroke="null" x="9790.779442" y="7646.068258" width="503.32529" height="283.92709" fill="#f2f2f2" id="svg_966"/>
     <circle stroke="null" cx="10042.011892" cy="7633.162478" r="5.162109" fill="#f9a826" id="svg_967"/>
     <path stroke="null" d="m10327.16548,7924.833003l-49.12128,0l0,-3.53914a0.70171,0.70171 0 0 0 -0.70173,-0.70175l-16.84158,0a0.70171,0.70171 0 0 0 -0.70173,0.70175l0,3.53914l-10.526,0l0,-3.53914a0.70171,0.70171 0 0 0 -0.70173,-0.70175l-16.84158,0a0.70171,0.70171 0 0 0 -0.70173,0.70175l0,3.53914l-10.526,0l0,-3.53914a0.70171,0.70171 0 0 0 -0.70173,-0.70175l-16.84157,0a0.70171,0.70171 0 0 0 -0.70173,0.70175l0,3.53914l-10.52601,0l0,-3.53914a0.70171,0.70171 0 0 0 -0.70173,-0.70175l-16.84156,0a0.70171,0.70171 0 0 0 -0.70174,0.70175l0,3.53914l-10.52597,0l0,-3.53914a0.70171,0.70171 0 0 0 -0.70174,-0.70175l-16.84159,0a0.70171,0.70171 0 0 0 -0.70173,0.70175l0,3.53914l-10.526,0l0,-3.53914a0.70171,0.70171 0 0 0 -0.70173,-0.70175l-16.84157,0a0.70171,0.70171 0 0 0 -0.70173,0.70175l0,3.53914l-10.526,0l0,-3.53914a0.70171,0.70171 0 0 0 -0.70173,-0.70175l-131.92571,0a0.70171,0.70171 0 0 0 -0.70173,0.70175l0,3.53914l-10.526,0l0,-3.53914a0.70171,0.70171 0 0 0 -0.70173,-0.70175l-16.84157,0a0.70171,0.70171 0 0 0 -0.70174,0.70175l0,3.53914l-10.526,0l0,-3.53914a0.70172,0.70172 0 0 0 -0.70174,-0.70175l-16.84156,0a0.70171,0.70171 0 0 0 -0.70173,0.70175l0,3.53914l-10.526,0l0,-3.53914a0.70171,0.70171 0 0 0 -0.70173,-0.70175l-16.84157,0a0.70171,0.70171 0 0 0 -0.70173,0.70175l0,3.53914l-10.526,0l0,-3.53914a0.70171,0.70171 0 0 0 -0.70174,-0.70175l-16.84157,0a0.70171,0.70171 0 0 0 -0.70173,0.70175l0,3.53914l-10.526,0l0,-3.53914a0.70171,0.70171 0 0 0 -0.70173,-0.70175l-16.84157,0a0.70171,0.70171 0 0 0 -0.70173,0.70175l0,3.53914l-10.526,0l0,-3.53914a0.70171,0.70171 0 0 0 -0.70173,-0.70175l-16.84157,0a0.70171,0.70171 0 0 0 -0.70174,0.70175l0,3.53914l-32.27969,0a16.84159,16.84159 0 0 0 -16.84158,16.84159l0,7.61537a16.84158,16.84158 0 0 0 16.84158,16.84154l559.98256,0a16.84158,16.84158 0 0 0 16.8416,-16.84154l0,-7.61537a16.84159,16.84159 0 0 0 -16.8416,-16.84159z" fill="#3f3d56" id="svg_968"/>
     <rect stroke="null" x="9993.795532" y="7668.305588" width="141.24028" height="5.24823" fill="#e6e6e6" id="svg_969"/>
     <rect stroke="null" x="9993.795532" y="7684.924978" width="141.24028" height="5.24823" fill="#e6e6e6" id="svg_970"/>
     <rect stroke="null" x="9993.795532" y="7701.544358" width="141.24028" height="5.24823" fill="#e6e6e6" id="svg_971"/>
     <rect stroke="null" x="9993.795532" y="7668.305588" width="141.24028" height="5.24823" fill="#ccc" id="svg_972"/>
     <rect stroke="null" x="9993.795532" y="7684.924978" width="141.24028" height="5.24823" fill="#ccc" id="svg_973"/>
     <rect stroke="null" x="9993.795532" y="7701.544358" width="141.24028" height="5.24823" fill="#ccc" id="svg_974"/>
     <rect stroke="null" x="9949.007062" y="7671.549088" width="32" height="32" fill="#ccc" id="svg_975"/>
     <rect stroke="null" x="9993.795532" y="7855.305588" width="141.24028" height="5.24823" fill="#ccc" id="svg_976"/>
     <rect stroke="null" x="9993.795532" y="7871.924978" width="141.24028" height="5.24823" fill="#ccc" id="svg_977"/>
     <rect stroke="null" x="9993.795532" y="7888.544358" width="141.24028" height="5.24823" fill="#ccc" id="svg_978"/>
     <rect stroke="null" x="9949.007062" y="7858.549088" width="32" height="32" fill="#ccc" id="svg_979"/>
     <circle stroke="null" cx="10042.007062" cy="7778.580588" r="56" fill="#f9a826" id="svg_980"/>
     <polygon stroke="null" points="10062.839206695557,7790.896266937256 10041.950534820557,7748.708278656006 10021.170261383057,7790.949977874756 10032.913425445557,7790.934841156006 10032.913425445557,7808.452907562256 10051.087253570557,7808.452907562256 10051.087253570557,7790.910915374756 10062.839206695557,7790.896266937256 " fill="#d0cde1" id="svg_981"/>
    </g>
   </g>
   <polygon stroke="null" id="svg_872" fill="#f9a826" points="495.7115783691406,311.9872131347656 495.7115783691406,376.6124267578125 472.7153015136719,374.2132568359375 462.71209716796875,373.1758117675781 459.66375732421875,372.8515930175781 449.6674499511719,371.8079833984375 435.85736083984375,370.3682861328125 435.85736083984375,307.8373107910156 484.94366455078125,311.23516845703125 495.7115783691406,311.9872131347656 "/>
   <polygon stroke="null" id="svg_873" fill="#f9a826" points="543.822265625,304.193603515625 543.822265625,367.2171630859375 525.3902587890625,370.8158874511719 516.4261779785156,372.5665588378906 495.7115783691406,376.6124267578125 495.7115783691406,311.9872131347656 543.822265625,304.193603515625 "/>
   <polygon stroke="null" id="svg_874" opacity="0.05" points="543.822265625,304.193603515625 543.822265625,367.2171630859375 525.3902587890625,370.8158874511719 516.4261779785156,372.5665588378906 495.7115783691406,376.6124267578125 495.7115783691406,311.9872131347656 543.822265625,304.193603515625 "/>
   <polygon stroke="null" id="svg_875" fill="#f9a826" points="418.0828552246094,321.4406433105469 435.85736083984375,307.8373107910156 495.7115783691406,311.9872131347656 486.9000244140625,327.08172607421875 418.0828552246094,321.4406433105469 "/>
   <polygon stroke="null" id="svg_876" opacity="0.1" fill="#fff" points="418.0828552246094,321.4406433105469 435.85736083984375,307.8373107910156 495.7115783691406,311.9872131347656 486.9000244140625,327.08172607421875 418.0828552246094,321.4406433105469 "/>
   <polygon stroke="null" id="svg_877" fill="#f9a826" points="543.822265625,304.193603515625 495.7115783691406,311.9872131347656 511.3699035644531,326.25177001953125 562.9034423828125,317.4595031738281 543.822265625,304.193603515625 "/>
   <polygon stroke="null" id="svg_878" opacity="0.1" fill="#fff" points="543.822265625,304.193603515625 495.7115783691406,311.9872131347656 511.3699035644531,326.25177001953125 562.9034423828125,317.4595031738281 543.822265625,304.193603515625 "/>
   <polygon stroke="null" id="svg_879" opacity="0.1" fill="#fff" points="525.3902587890625,370.8158874511719 516.4261779785156,372.5665588378906 516.4261779785156,359.099365234375 524.8231201171875,356.946533203125 525.3902587890625,370.8158874511719 "/>
   <polygon stroke="null" id="svg_880" opacity="0.1" fill="#fff" points="472.7153015136719,365.3043518066406 472.7153015136719,374.2132568359375 462.71209716796875,373.1758117675781 462.71209716796875,365.3043518066406 472.7153015136719,365.3043518066406 "/>
   <polygon stroke="null" id="svg_881" opacity="0.1" fill="#fff" points="459.66375732421875,368.11187744140625 459.66375732421875,372.8515930175781 449.6674499511719,371.8079833984375 449.6674499511719,368.11187744140625 459.66375732421875,368.11187744140625 "/>
   <path stroke="null" id="svg_882" opacity="0.1" d="m489.692965,360.577665c-6.853756,8.915406 -29.487083,2.755672 -29.487083,2.755672l-16.818803,-17.843763l-2.282454,-2.418512l4.462907,-8.429099s1.275112,0.427943 3.404558,1.180081c11.272037,4.007053 46.490786,17.253722 40.720875,24.755621z"/>
   <path stroke="null" id="svg_883" fill="#efb7b9" d="m489.055409,359.280885c-6.853756,8.915392 -29.487083,2.755672 -29.487083,2.755672l-16.818803,-17.843763l-2.282454,-2.418512l4.462907,-8.429099s1.275112,0.427929 3.404558,1.180067c11.272037,4.007068 46.490772,17.253722 40.720875,24.755635z"/>
   <path stroke="null" id="svg_884" opacity="0.1" d="m448.309038,334.52525c-0.930838,2.723253 -3.296176,6.75625 -5.585011,9.667544l-2.282468,-2.418512l4.462921,-8.429099s1.281493,0.427929 3.404558,1.180067l0,0z"/>
   <path stroke="null" id="svg_885" fill="#dce6f2" d="m392.624668,233.68723s-16.735918,6.483929 -16.895307,24.638922a293.327971,298.312474 0 0 0 1.912682,35.013206s-4.781699,27.070385 8.766425,34.851094s26.139899,14.264639 26.139899,14.264639s21.645114,3.56616 24.303735,4.700842s11.896845,-13.454137 10.462344,-15.885614s-21.141451,-8.429099 -23.481279,-12.481552s-8.103372,-6.782194 -8.103372,-6.782194s-5.878293,-4.078382 -6.114186,-7.482444s1.498257,-5.835539 1.989172,-7.294417s2.269719,-15.723531 2.269719,-15.723531s9.512377,-50.607044 -21.249832,-47.818953z"/>
   <path stroke="null" id="svg_886" opacity="0.1" d="m400.275369,293.793232s-22.633326,2.593575 -20.880047,10.698479c0,0 8.600669,-8.176233 20.880047,-10.698479z"/>
   <path stroke="null" id="svg_887" opacity="0.1" d="m400.275369,297.035196s-12.846812,9.563782 -10.48784,10.212186s10.48784,-10.212186 10.48784,-10.212186z"/>
   <path stroke="null" id="svg_888" opacity="0.1" d="m406.013402,300.925551s-3.665962,6.704376 -1.593904,6.354251s1.593904,-6.354251 1.593904,-6.354251z"/>
   <path stroke="null" id="svg_889" fill="#f9a826" d="m641.667817,155.504054s-24.227231,-1.484822 -21.396473,15.801334c0,0 -0.567433,3.053923 2.154942,4.441486c0,0 0.04464,-1.296794 2.486483,-0.849397a11.163655,11.353359 0 0 0 2.633124,0.129678a5.463881,5.556729 0 0 0 3.22604,-1.355144l0,0s6.815497,-2.859406 9.46775,-14.19331c0,0 1.963676,-2.476861 1.912668,-3.112287l-4.093121,1.783087s1.396256,3.002049 0.293281,5.498365c0,0 -0.127511,-5.388141 -0.918089,-5.264953c-0.159389,0 -2.123065,1.043914 -2.123065,1.043914s2.403584,5.226044 0.586549,9.032105c0,0 0.688563,-6.44502 -1.338868,-8.656036l-2.881765,1.711758s2.811628,5.401106 0.905327,9.810173c0,0 0.490915,-6.762725 -1.511019,-9.395209l-2.61398,2.068373s2.645858,5.329792 1.032838,8.986735c0,0 -0.210396,-7.871493 -1.600271,-8.468009c0,0 -2.282454,2.048918 -2.626742,2.891825c0,0 1.804301,3.890355 0.682196,5.906853c0,0 -0.688563,-5.245498 -1.275126,-5.271428c0,0 -2.276072,3.475391 -2.51198,5.835539a12.40689,12.617719 0 0 1 1.957309,-6.185664a6.82826,6.944292 0 0 0 -3.481076,1.834947s0.350656,-2.457407 4.042128,-2.671378c0,0 1.912668,-2.638959 2.384468,-2.801057c0,0 -3.672343,-0.31123 -5.897422,0.693774c0,0 1.957309,-2.31475 6.573237,-1.29678l2.550224,-2.139702s-4.832692,-0.64839 -6.88562,0.071329c0,0 2.358958,-2.048918 7.580565,-0.557621l2.805261,-1.705269s-4.118632,-0.907746 -6.573237,-0.577076c0,0 2.588498,-1.419983 7.395693,0.116713l2.008302,-0.914236s-3.022024,-0.603006 -3.901855,-0.700264s-0.930838,-0.34365 -0.930838,-0.34365a10.430466,10.60771 0 0 1 5.667896,0.64839s4.303518,-1.575591 4.214266,-1.847912l0,0z"/>
   <path stroke="null" id="svg_890" opacity="0.1" fill="#f9a826" d="m715.280332,241.960722s-24.227231,-1.484822 -21.396473,15.801334c0,0 -0.567433,3.053923 2.154957,4.441486c0,0 0.044626,-1.296794 2.49285,-0.849397a11.163655,11.353359 0 0 0 2.63311,0.129678a5.4575,5.550239 0 0 0 3.187795,-1.348654l0,0s6.821879,-2.865896 9.474118,-14.1998c0,0 1.957309,-2.470372 1.880805,-3.105797l-4.093121,1.776597s1.396242,3.002049 0.299649,5.498365c0,0 -0.133892,-5.388141 -0.918089,-5.264953c-0.159389,0 -2.129446,1.043914 -2.129446,1.043914s2.409979,5.232534 0.59293,9.032119c0,0 0.688563,-6.445034 -1.345249,-8.65605l-2.849887,1.692304s2.811642,5.401106 0.905341,9.810187c0,0 0.490915,-6.76274 -1.511019,-9.395209l-2.607613,2.074848s2.639491,5.323302 1.032838,8.980245c0,0 -0.210382,-7.871493 -1.600271,-8.468009c0,0 -2.282454,2.048918 -2.63311,2.891825c0,0 1.810668,3.890355 0.688563,5.906853c0,0 -0.688563,-5.245484 -1.275112,-5.271428c0,0 -2.276087,3.475391 -2.51198,5.835539a12.445149,12.656628 0 0 1 1.963676,-6.185664a6.860123,6.976697 0 0 0 -3.487443,1.834947s0.357023,-2.457407 4.048495,-2.671378c0,0 1.88079,-2.638959 2.384468,-2.801057c0,0 -3.672343,-0.31123 -5.897422,0.693789c0,0 1.957309,-2.314764 6.566856,-1.264375l2.550239,-2.139687s-4.839073,-0.64839 -6.885634,0.071314c0,0 2.358972,-2.048918 7.580565,-0.557607l2.805261,-1.705283s-4.124999,-0.901256 -6.579604,-0.577061c0,0 2.594865,-1.419983 7.40206,0.116699l2.008302,-0.914221s-3.022024,-0.603006 -3.908222,-0.700264s-0.930838,-0.34365 -0.930838,-0.34365a10.449581,10.62715 0 0 1 5.674263,0.64839s4.309899,-1.58857 4.233395,-1.860891l0,0z"/>
   <path stroke="null" id="svg_891" opacity="0.1" fill="#f9a826" d="m568.099928,226.613275s5.57863,-24.048882 -11.660952,-24.133175c0,0 -2.862635,-1.089298 -4.666936,1.400528c0,0 1.2305,0.265846 0.395296,2.638959a11.348541,11.541386 0 0 0 -0.5738,2.593575a5.476629,5.569694 0 0 0 0.758686,3.455922l0,0s1.61302,7.326836 12.113622,11.917455c0,0 2.06569,2.386093 2.690498,2.412022l-1.020104,-4.402577s-3.149536,0.888291 -5.380996,-0.64839c0,0 5.247118,0.784543 5.253485,0c0,-0.162098 -0.637556,-2.308289 -0.637556,-2.308289s-5.476629,1.517241 -8.855691,-0.953131c0,0 6.126934,1.789562 8.619798,0.136153l-1.147615,-3.190091s-5.738019,1.8998 -9.665384,-0.765103c0,0 6.471223,1.646919 9.365736,0.090783l-1.562012,-2.969644s-5.610522,1.737688 -8.881202,-0.499257c0,0 7.650716,1.128207 8.479538,-0.155622c0,0 -1.593904,-2.638945 -2.35259,-3.131727c0,0 -4.054877,1.154137 -5.840034,-0.31772c0,0 5.196096,0.201007 5.317226,-0.356615c0,0 -2.977398,-2.872371 -5.247104,-3.520775a12.496156,12.708502 0 0 1 5.667896,3.021518a6.879253,6.996152 0 0 0 -1.18586,-3.806061s2.320713,0.778068 1.912682,4.538745c0,0 2.231446,2.334204 2.301583,2.865896c0,0 0.924456,-3.624523 0.331526,-6.030056c0,0 1.912682,2.360148 0.108382,6.801635l1.632163,2.950189s1.479127,-4.733262 1.102975,-6.911858c0,0 1.587509,2.710273 -0.752319,7.689926l1.179479,3.105811s1.574775,-3.981138 1.676775,-6.483929c0,0 0.937219,2.839951 -1.377127,7.398151l0.548304,2.165631s1.096608,-2.924245 1.338868,-3.793096s0.490929,-0.875327 0.490929,-0.875327a10.443214,10.620675 0 0 1 -1.587523,5.576183s0.835204,4.52578 1.109356,4.49336l0,0z"/>
   <path stroke="null" id="svg_892" opacity="0.1" fill="#f9a826" d="m515.0423,234.808948s-19.458294,-14.802791 -26.414065,1.231955c0,0 -2.123065,2.236946 -0.599297,4.914814c0,0 0.726808,-1.043914 2.550239,0.687299a11.163655,11.353359 0 0 0 2.129446,1.582066a5.470248,5.563204 0 0 0 3.423688,0.648404l0,0s7.242657,1.419968 15.581936,-6.561733c0,0 2.977384,-0.972599 3.257917,-1.543186l-4.392784,-0.784543s-0.459038,3.287349 -2.722376,4.759192c0,0 2.798894,-4.577654 2.072071,-4.908324c-0.146641,-0.071329 -2.339842,-0.324195 -2.339842,-0.324195s-0.816075,5.718812 -4.386403,7.877968c0,0 4.061244,-4.999107 3.55758,-7.981716l-3.334435,-0.181552s-0.567419,6.088406 -4.545792,8.70791c0,0 4.061244,-5.375162 3.825351,-8.694945l-3.302558,0.272335s-0.669434,5.919818 -3.991107,8.072485c0,0 4.073992,-6.691411 3.238788,-7.962261c0,0 -3.015643,0.434418 -3.761595,0.940166c0,0 -0.580168,4.240494 -2.620361,5.316827c0,0 2.263338,-4.765696 1.804287,-5.096366c0,0 -3.780711,1.627465 -5.266233,3.481866a12.451516,12.663104 0 0 1 4.985714,-4.071907a6.866505,6.983187 0 0 0 -3.901855,-0.414964s1.619401,-1.854416 4.819944,0.03242c0,0 2.996514,-1.147662 3.506573,-1.005019c0,0 -2.900894,-2.314764 -5.304492,-2.716763c0,0 2.894513,-0.842907 6.177941,2.593575l3.308925,-0.34365s-3.67871,-3.241965 -5.789026,-3.786607c0,0 3.079413,-0.395524 6.630612,3.767152l3.264299,0.149133s-2.951902,-3.060413 -5.176981,-4.162676c0,0 2.926391,0.259356 6.114186,4.234004l2.174072,0.356615s-2.199569,-2.191576 -2.888132,-2.762162s-0.59293,-0.810488 -0.59293,-0.810488a10.475092,10.653094 0 0 1 4.39277,3.708803s4.431043,1.043914 4.513928,0.778082l0,-0.000014z"/>
   <path stroke="null" id="svg_893" opacity="0.1" fill="#f9a826" d="m579.824621,97.278397s-19.45828,-14.80928 -26.414051,1.231941c0,0 -2.123065,2.23696 -0.599311,4.914828c0,0 0.726822,-1.043914 2.550239,0.687285a11.342174,11.534911 0 0 0 2.135827,1.575605a5.463881,5.556729 0 0 0 3.423688,0.64839l0,0s7.242671,1.419983 15.581936,-6.568223c0,0 2.977398,-0.96611 3.25155,-1.543171l-4.392784,-0.771593s-0.45267,3.287349 -2.722376,4.759206c0,0 2.805261,-4.577654 2.078439,-4.908324c-0.146641,-0.071329 -2.339842,-0.324209 -2.339842,-0.324209s-0.841571,5.731791 -4.4119,7.877982c0,0 4.054877,-4.999107 3.55758,-7.981716l-3.334435,-0.181552s-0.5738,6.088406 -4.545792,8.701435c0,0 4.061244,-5.375176 3.825351,-8.694945l-3.296176,0.272321s-0.675815,5.926308 -3.997488,8.078974c0,0 4.080373,-6.691411 3.245169,-7.962261c0,0 -3.015657,0.434418 -3.761595,0.940166c0,0 -0.580182,4.240494 -2.620361,5.316827c0,0 2.263324,-4.765696 1.804287,-5.102856c0,0 -3.780725,1.633954 -5.266233,3.488356a12.394141,12.604754 0 0 1 4.9857,-4.071907a6.821879,6.937802 0 0 0 -3.908236,-0.414978s1.625782,-1.854401 4.826325,0.03242c0,0 2.996528,-1.154137 3.506573,-1.005005c0,0 -2.900894,-2.314764 -5.304492,-2.723253c0,0 2.888146,-0.836417 6.171574,2.593575l3.308925,-0.34365s-3.672343,-3.241965 -5.789026,-3.793096c0,0 3.079399,-0.389034 6.636979,3.773642l3.264299,0.142657s-2.951888,-3.060413 -5.183348,-4.1562c0,0 2.932772,0.259356 6.120567,4.234004l2.167691,0.356615s-2.20595,-2.165631 -2.894513,-2.723253s-0.59293,-0.803998 -0.59293,-0.803998a10.455962,10.63364 0 0 1 4.392784,3.708803s4.431029,0.98555 4.539411,0.739159l0,0z"/>
   <path stroke="null" id="svg_894" opacity="0.1" fill="#f9a826" d="m654.176707,116.036396s-7.778213,-23.413457 -22.448441,-14.212764c0,0 -2.996514,0.64839 -3.232421,3.702327c0,0 1.179493,-0.440908 1.702286,2.022974a11.476052,11.671064 0 0 0 0.873449,2.535225a5.521256,5.615078 0 0 0 2.448224,2.522246l0,0s5.176981,5.349232 16.500025,3.579125c0,0 2.990147,0.920725 3.53845,0.603006l-3.187795,-3.183615s-2.20595,2.444442 -4.896448,2.347183c0,0 4.86457,-2.152666 4.462907,-2.846441c-0.082885,-0.136168 -1.746912,-1.60801 -1.746912,-1.60801s-3.86361,4.234004 -8.007739,3.955194c0,0 6.126948,-1.776597 7.376564,-4.538745l-2.639491,-2.068373s-3.86361,4.681388 -8.600669,4.538745c0,0 6.375575,-2.081338 7.988609,-4.960198l-2.869017,-1.679339s-3.825351,4.49336 -7.790961,4.350703c0,0 7.089649,-3.157671 7.108779,-4.687877c0,0 -2.722376,-1.381074 -3.621336,-1.394039c0,0 -2.84352,3.157671 -5.100477,2.872385c0,0 4.513914,-2.625994 4.322647,-3.164161c0,0 -4.016618,-0.836432 -6.279942,-0.162098a12.426019,12.637174 0 0 1 6.375575,-0.486293a6.879253,6.996152 0 0 0 -2.990147,-2.593575s2.37172,-0.590041 3.959243,2.807546c0,0 3.111291,0.784543 3.442817,1.193032c0,0 -1.096608,-3.572635 -2.849887,-5.297358c0,0 2.849887,0.979075 3.627703,5.718812l2.920024,1.620989s-1.20499,-4.80459 -2.65862,-6.483929c0,0 2.760635,1.452402 3.359932,6.931313l2.613994,2.003534s-0.726822,-4.227515 -1.950927,-6.41909c0,0 2.269705,1.906275 2.677736,7.022096l1.587523,1.543171s-0.586549,-3.073377 -0.828823,-3.942229s-0.044626,-0.927201 -0.044626,-0.927201a10.513337,10.691989 0 0 1 1.549264,5.589148s3.08578,3.365153 3.308925,3.19658l0,0z"/>
   <path stroke="null" id="svg_895" opacity="0.1" fill="#f9a826" d="m603.414296,117.190533s-24.163475,-2.736217 -22.167908,14.699057c0,0 -0.720441,3.021518 1.912668,4.538759c0,0 0.108382,-1.296794 2.550239,-0.713243a11.731075,11.93042 0 0 0 2.626742,0.265846a5.482997,5.576169 0 0 0 3.283428,-1.186557l0,0s6.955757,-2.509281 10.200926,-13.694052c0,0 2.078453,-2.366638 2.033812,-3.008538l-4.176007,1.569101s1.275126,3.066902 0,5.504854c0,0 0.133892,-5.388141 -0.637556,-5.303848c-0.159389,0 -2.174072,0.93369 -2.174072,0.93369s2.142194,5.349232 0.14026,9.077489c0,0 1.007341,-6.406111 -0.911708,-8.7144l-2.96465,1.55615s2.550239,5.543749 0.414411,9.849082c0,0 0.828823,-6.73032 -1.039219,-9.460048l-2.709628,1.94517s2.37172,5.45298 0.580182,9.02563c0,0 0.1849,-7.871493 -1.173112,-8.539323c0,0 -2.384468,1.94517 -2.773369,2.749182c0,0 1.61302,3.955194 0.395282,5.932783c0,0 -0.427174,-5.271428 -0.988212,-5.323302c0,0 -2.448238,3.352188 -2.805261,5.718826a12.413271,12.624209 0 0 1 2.269705,-6.081916a6.860123,6.976697 0 0 0 -3.570328,1.653395s0.471786,-2.431477 4.169639,-2.457407c0,0 2.008302,-2.535211 2.550224,-2.671378c0,0 -3.653213,-0.499257 -5.929286,0.389034c0,0 2.072057,-2.217505 6.62423,-0.927201l2.684117,-2.003534s-4.851822,-0.998515 -6.904764,-0.350125c0,0 2.460986,-1.945185 7.599708,-0.162098l2.888132,-1.562626s-4.073992,-1.115242 -6.541345,-0.914236c0,0 2.65862,-1.296794 7.382931,0.499257l2.052942,-0.810488s-2.990161,-0.758613 -3.869991,-0.901271s-0.911708,-0.389034 -0.911708,-0.389034a10.48784,10.666059 0 0 1 5.636019,0.93369s4.297151,-1.394039 4.252525,-1.666374l0,0z"/>
   <path stroke="null" id="svg_896" opacity="0.1" fill="#f9a826" d="m814.828732,307.928192s-24.150727,-2.736217 -22.155159,14.679602c0,0 -0.720441,3.021518 1.912668,4.538745c0,0 0.108382,-1.29678 2.550239,-0.719719a11.029763,11.217191 0 0 0 2.626742,0.265846a5.43837,5.530784 0 0 0 3.283428,-1.186557l0,0s6.955757,-2.509281 10.169048,-13.687563c0,0 2.078453,-2.373128 2.033812,-3.008553l-4.176007,1.562626s1.275126,3.073392 0,5.511344c0,0 0.133892,-5.394631 -0.637556,-5.303848c-0.159389,0 -2.174072,0.927201 -2.174072,0.927201s2.142194,5.349232 0.14026,9.077489c0,0 1.007341,-6.399636 -0.911708,-8.714385l-2.96465,1.562611s2.550239,5.543764 0.420793,9.849097c0,0 0.822442,-6.73032 -1.0456,-9.466538l-2.709628,1.945185s2.37172,5.45298 0.580182,9.01914c0,0 0.1849,-7.871493 -1.173112,-8.532848c0,0 -2.378087,1.94517 -2.773369,2.749182c0,0 1.619401,3.955194 0.395282,5.932798c0,0 -0.42716,-5.271443 -0.988212,-5.323317c0,0 -2.448224,3.352188 -2.805261,5.718826a12.413271,12.624209 0 0 1 2.269705,-6.081916a6.802749,6.918348 0 0 0 -3.570328,1.653395s0.4718,-2.437952 4.169639,-2.463882c0,0 2.014683,-2.535225 2.550224,-2.664903c0,0 -3.653199,-0.505747 -5.929286,0.382559c0,0 2.072057,-2.21103 6.630612,-0.920725l2.677736,-2.003534s-4.794433,-0.920711 -6.879253,-0.285286c0,0 2.460972,-1.945185 7.599694,-0.168587l2.888146,-1.556136s-4.074006,-1.115242 -6.541359,-0.914236c0,0 2.65862,-1.296794 7.382931,0.499257l2.052942,-0.816977s-2.990147,-0.758613 -3.869977,-0.894781s-0.911708,-0.389034 -0.911708,-0.389034a10.449581,10.62715 0 0 1 5.636019,0.927201s4.309899,-1.419968 4.246143,-1.698779l0,0z"/>
   <path stroke="null" id="svg_897" opacity="0.1" fill="#f9a826" d="m851.749752,330.868321s-24.150727,-2.729728 -22.155159,14.679602c0,0 -0.714074,3.021518 1.912668,4.538745c0,0 0.108382,-1.29678 2.550239,-0.713229a11.252908,11.444127 0 0 0 2.620361,0.259356a5.508507,5.602113 0 0 0 3.27068,-1.180067l0,0s6.94939,-2.509281 10.162681,-13.694052c0,0 2.08482,-2.366638 2.033812,-3.008538l-4.176007,1.562626s1.275112,3.073377 0,5.51133c0,0 0.133878,-5.388141 -0.637556,-5.303848c-0.159389,0 -2.174086,0.927201 -2.174086,0.927201s2.142208,5.349232 0.140274,9.077489c0,0 1.007341,-6.399636 -0.911708,-8.70791l-2.96465,1.55615s2.550224,5.543749 0.420779,9.849082c0,0 0.822456,-6.73032 -1.045586,-9.460048l-2.709628,1.94517s2.37172,5.45298 0.586549,9.02563c0,0 0.178519,-7.877968 -1.179479,-8.539337c0,0 -2.378087,1.945185 -2.773383,2.749197c0,0 1.619401,3.955194 0.395296,5.932783c0,0 -0.427174,-5.271428 -0.988226,-5.323302c0,0 -2.448224,3.352188 -2.79888,5.718826a12.445149,12.656628 0 0 1 2.263338,-6.08193a6.860123,6.976697 0 0 0 -3.570328,1.653409s0.478167,-2.437952 4.176007,-2.457407c0,0 2.008302,-2.535211 2.550239,-2.671378c0,0 -3.653213,-0.499257 -5.9293,0.389034c0,0 2.072057,-2.217505 6.630612,-0.927201l2.677736,-2.003534s-4.794433,-0.920711 -6.879253,-0.285286c0,0 2.460972,-1.945185 7.599694,-0.162098l2.888146,-1.562626s-4.074006,-1.115242 -6.541345,-0.914236c0,0 2.658606,-1.296794 7.382917,0.499257l2.052942,-0.810488s-2.990147,-0.758628 -3.863596,-0.901271s-0.918089,-0.389034 -0.918089,-0.389034a10.48784,10.666059 0 0 1 5.636019,0.93369s4.329014,-1.432948 4.265259,-1.711758l0.000014,0z"/>
   <path stroke="null" id="svg_898" opacity="0.1" fill="#f9a826" d="m769.778843,137.640836s-19.458294,-14.802805 -26.414065,1.231941c0,0 -2.123065,2.23696 -0.599297,4.914828c0,0 0.726808,-1.043914 2.550239,0.687285a11.163655,11.353359 0 0 0 2.129446,1.58208a5.476629,5.569694 0 0 0 3.423688,0.64839l0,0s7.242657,1.419983 15.588303,-6.561733c0,0 2.971031,-0.972585 3.25155,-1.543171l-4.380022,-0.803998s-0.459052,3.287349 -2.722376,4.759192c0,0 2.79888,-4.577654 2.072057,-4.908324c-0.146641,-0.071329 -2.333461,-0.324195 -2.333461,-0.324195s-0.822456,5.718826 -4.392784,7.877968c0,0 4.061258,-4.999107 3.55758,-7.981716l-3.334435,-0.181552s-0.567419,6.088406 -4.545792,8.707924c0,0 4.067625,-5.375176 3.825351,-8.694945l-3.302543,0.272321s-0.637556,5.919818 -3.991121,8.072485c0,0 4.080373,-6.691411 3.238802,-7.962261c0,0 -3.015657,0.434418 -3.761595,0.940166c0,0 -0.573815,4.240494 -2.613994,5.316827c0,0 2.256957,-4.765681 1.797919,-5.096366c0,0 -3.780725,1.627465 -5.266233,3.481866a12.451516,12.663104 0 0 1 4.9857,-4.071907a6.866505,6.983187 0 0 0 -3.901855,-0.414964s1.625768,-1.854401 4.826311,0.03242c0,0 2.990161,-1.147662 3.500206,-1.005019c0,0 -2.900894,-2.31475 -5.304492,-2.716763c0,0 2.894513,-0.842907 6.177941,2.593575l3.308925,-0.34365s-3.672329,-3.241965 -5.789026,-3.786607c0,0 3.079413,-0.395524 6.630612,3.767152l3.27068,0.149133s-2.958283,-3.060413 -5.183362,-4.162676c0,0 2.932772,0.259356 6.114186,4.234004l2.174086,0.356615s-2.199583,-2.191576 -2.888146,-2.762162s-0.586549,-0.758613 -0.586549,-0.758613a10.481459,10.65957 0 0 1 4.386403,3.708803s4.418281,1.011494 4.501166,0.745649l0,0z"/>
   <path stroke="null" id="svg_899" opacity="0.1" fill="#f9a826" d="m784.812475,244.508912s-6.707116,-23.750631 -21.791755,-15.224259c0,0 -3.022024,0.473328 -3.398191,3.546705c0,0 1.198608,-0.382559 1.61302,2.100792a11.303915,11.496002 0 0 0 0.765081,2.593575a5.476629,5.569694 0 0 0 2.333461,2.645434l0,0s4.934707,5.576183 16.321493,4.331263c0,0 2.94552,1.050403 3.506573,0.765103l-3.015643,-3.332733s-2.314346,2.347183 -4.992081,2.126722c0,0 4.947455,-1.94517 4.564921,-2.638959c-0.076518,-0.142643 -1.670408,-1.692304 -1.670408,-1.692304s-4.042128,4.058942 -8.173509,3.585614c0,0 6.203452,-1.491297 7.56783,-4.175655l-2.550239,-2.191561s-4.067625,4.49985 -8.791935,4.149711c0,0 6.426597,-1.796052 8.199005,-4.590619l-2.792513,-1.809017s-4.048495,4.311808 -7.975847,3.987613c0,0 7.223528,-2.833476 7.312794,-4.357193c0,0 -2.665001,-1.504276 -3.563961,-1.556136c0,0 -2.977398,3.021503 -5.240722,2.632469c0,0 4.628677,-2.418512 4.462907,-2.963154c0,0 -3.978373,-1.017984 -6.267208,-0.453873a12.438768,12.650139 0 0 1 6.375589,-0.188042a6.841008,6.957257 0 0 0 -2.869017,-2.723253s2.397231,-0.486293 3.825351,2.982609c0,0 3.066665,0.920725 3.385443,1.348654c0,0 -0.937219,-3.624509 -2.613994,-5.420561c0,0 2.805261,1.102277 3.372694,5.874448l2.843506,1.757143s-0.994593,-4.862954 -2.37172,-6.574712c0,0 2.690498,1.575605 3.053902,7.07397l2.550239,2.120247s-0.541923,-4.253459 -1.664027,-6.483929c0,0 2.18682,2.010024 2.365339,7.132319l1.517386,1.620975s-0.446289,-3.099307 -0.637556,-3.981124s0,-1.005005 0,-1.005005a10.449581,10.62715 0 0 1 1.307004,5.653973s2.907261,3.488356 3.136787,3.332748z"/>
   <path stroke="null" id="svg_900" opacity="0.1" fill="#f9a826" d="m635.355983,298.027236s-13.02533,-20.865281 -25.119809,-8.37724c0,0 -2.767002,1.296794 -2.282468,4.376662c0,0 1.051982,-0.713243 2.135827,1.556136a10.915,11.100478 0 0 0 1.440882,2.243435a5.444752,5.537274 0 0 0 2.96465,1.867366l0,0s6.279956,3.942229 16.863429,-0.518712c0,0 3.117658,0.168587 3.576695,-0.265831l-3.825351,-2.334219s-1.574775,2.91777 -4.207884,3.468901c0,0 4.220633,-3.241965 3.653213,-3.838481c-0.108396,-0.116713 -2.072071,-1.141172 -2.072071,-1.141172s-2.760635,5.044492 -6.853756,5.777175c0,0 5.540385,-3.209545 6.114186,-6.179174l-3.053902,-1.368109s-2.65862,5.47891 -7.287297,6.483915c0,0 5.674278,-3.55967 6.598734,-6.749761l-3.187795,-0.93369s-2.690498,5.297373 -6.547727,6.10786c0,0 6.146063,-4.785136 5.808156,-6.276433c0,0 -2.971017,-0.680824 -3.825351,-0.473328c0,0 -2.021064,3.754187 -4.303518,4.026508c0,0 3.774343,-3.643964 3.461947,-4.123766c0,0 -4.099503,0.162098 -6.139696,1.361619a12.40689,12.617719 0 0 1 6.082308,-2.010024a6.841008,6.957257 0 0 0 -3.500191,-1.796038s2.161324,-1.147662 4.462907,1.770108c0,0 3.187795,0 3.627717,0.324195c0,0 -1.912682,-3.241965 -4.01025,-4.454451c0,0 2.996528,0.259356 4.858203,4.674912l3.219672,0.868837s-2.301597,-4.376647 -4.093136,-5.628043c0,0 3.015657,0.739159 4.883699,5.919818l3.009276,1.296794s-1.695905,-3.922774 -3.398177,-5.757735c0,0 2.652239,1.296794 4.239762,6.166224l1.912668,1.121718s-1.275112,-2.846441 -1.727783,-3.630999s-0.274152,-0.96611 -0.274152,-0.96611a10.455962,10.63364 0 0 1 2.811642,5.050981s3.812602,2.580595 3.98474,2.360148l0,0z"/>
   <path stroke="null" id="svg_901" fill="#f9a826" d="m720.960977,191.418516s-12.38776,-21.26079 -24.864787,-9.161783c0,0 -2.805261,1.231941 -2.409979,4.305333c0,0 1.06473,-0.687299 2.08482,1.614485a11.017015,11.204226 0 0 0 1.37076,2.295309a5.412874,5.504854 0 0 0 2.907261,1.945185l0,0s6.152445,4.136746 16.869797,0c0,0 3.111291,0.265846 3.583091,-0.155622l-3.74248,-2.450917s-1.657646,2.859406 -4.309885,3.332733c0,0 4.316266,-3.131727 3.774343,-3.721768c-0.114763,-0.123188 -2.040194,-1.212501 -2.040194,-1.212501s-2.913643,4.960213 -7.013145,5.563218c0,0 5.636019,-3.034483 6.292704,-5.978182l-3.009276,-1.439437s-2.824376,5.401121 -7.484931,6.263482c0,0 5.782659,-3.378132 6.802749,-6.535803l-3.149536,-1.037424s-2.856268,5.187135 -6.732626,5.900364c0,0 6.286337,-4.590619 5.993056,-6.088406c0,0 -2.94552,-0.778068 -3.825351,-0.596516c0,0 -2.135827,3.689348 -4.424662,3.890355c0,0 3.882739,-3.514286 3.589458,-4.007068c0,0 -4.105884,0.03242 -6.177941,1.167102a12.445149,12.656628 0 0 1 6.139682,-1.815492a6.853756,6.970222 0 0 0 -3.449184,-1.906275s2.199569,-1.082823 4.462907,1.906275c0,0 3.187795,0.110223 3.614954,0.440908c0,0 -1.804287,-3.241965 -3.869977,-4.577654c0,0 2.983765,0.350125 4.711562,4.824045l3.187781,0.972585s-2.161324,-4.447976 -3.920984,-5.757735c0,0 2.996528,0.836432 4.705181,6.068965l2.96465,1.407004s-1.574761,-3.974648 -3.187795,-5.835525c0,0 2.607613,1.381074 4.054877,6.295887l1.868042,1.180067s-1.198608,-2.885336 -1.619401,-3.682858s-0.24226,-0.972599 -0.24226,-0.972599a10.475092,10.653094 0 0 1 2.658606,5.135275s3.653213,2.638959 3.838113,2.424987l0,0z"/>
   <path stroke="null" id="svg_902" fill="#f9a826" d="m642.585892,236.125197s0.637556,-24.703761 -16.238622,-21.221895c0,0 -3.022024,-0.473328 -4.297137,2.340694c0,0 1.275112,0 0.918089,2.496316a11.195533,11.385778 0 0 0 -0.038259,2.684343a5.451133,5.543764 0 0 0 1.434501,3.241965l0,0s3.041154,6.834054 14.268565,9.155308c0,0 2.49285,1.912751 3.117672,1.809002l-1.912682,-4.097837s-2.900894,1.517241 -5.393744,0.486293c0,0 5.29173,-0.317705 5.145089,-1.108753c0,-0.162098 -1.096594,-2.133212 -1.096594,-2.133212s-5.062218,2.625994 -8.855691,0.901271c0,0 6.375589,0.486293 8.460409,-1.646919l-1.77879,-2.872385s-5.21524,3.034483 -9.614391,1.24492c0,0 6.662489,0.272321 9.187217,-1.847926l-2.123065,-2.59356s-5.145103,2.865896 -8.791935,1.348654c0,0 7.727219,-0.473328 8.288258,-1.906275c0,0 -2.091187,-2.249925 -2.932758,-2.593575c0,0 -3.736099,1.945185 -5.776292,0.894781c0,0 5.100477,-0.868837 5.132355,-1.445913c0,0 -3.487443,-2.198051 -5.840034,-2.360148a12.413271,12.624209 0 0 1 6.15243,1.789562a6.853756,6.970222 0 0 0 -1.912668,-3.481866s2.429094,0.278811 2.760621,4.020033c0,0 2.65862,1.828471 2.830772,2.334219c0,0 0.184886,-3.741222 -0.87983,-5.971692c0,0 2.346209,1.912751 1.466379,6.633047l2.186834,2.554665s0.497282,-4.940744 -0.299663,-6.996152c0,0 2.091201,2.327729 0.803326,7.683451l1.766042,2.794581s0.752319,-4.221039 0.350656,-6.70439c0,0 1.479127,2.593575 0.127511,7.527843l0.969082,2.010024s0.490929,-3.092832 0.554685,-3.994103s0.30603,-0.95962 0.30603,-0.95962a10.468711,10.646605 0 0 1 -0.439922,5.79014s1.715034,4.279389 1.995553,4.195109l0,0z"/>
   <ellipse stroke="null" transform="matrix(0.6375586114013411,0,0,0.6483926033062267,-5119.936485861221,-767.25062549191) " id="svg_903" opacity="0.1" fill="#f9a826" ry="4.55" rx="26.93" cy="2027.051897" cx="9082.17981"/>
   <ellipse stroke="null" transform="matrix(0.6375586114013411,0,0,0.6483926033062267,-5119.936485861221,-767.25062549191) " id="svg_904" opacity="0.1" fill="#f9a826" ry="4.55" rx="26.93" cy="2096.131897" cx="8984.00981"/>
   <ellipse stroke="null" transform="matrix(0.6375586114013411,0,0,0.6483926033062267,-5119.936485861221,-767.25062549191) " id="svg_905" opacity="0.1" fill="#f9a826" ry="4.55" rx="26.93" cy="2060.741897" cx="8476.34981"/>
   <ellipse stroke="null" transform="matrix(0.6375586114013411,0,0,0.6483926033062267,-5119.936485861221,-767.25062549191) " id="svg_906" opacity="0.1" fill="#f9a826" ry="4.55" rx="26.93" cy="2091.581897" cx="9188.26981"/>
   <ellipse stroke="null" transform="matrix(0.6375586114013411,0,0,0.6483926033062267,-5119.936485861221,-767.25062549191) " id="svg_907" fill="#f9a826" ry="6.8" rx="40.21" cy="2033.851897" cx="9216.30981"/>
   <path stroke="null" id="svg_908" fill="#f9a826" d="m766.629293,544.267299a7.40206,7.527843 0 0 0 2.441857,-3.747712c0.318778,-1.491311 -0.30603,-3.274384 -1.702286,-3.81904c-1.568394,-0.609481 -3.245169,0.492782 -4.520281,1.608025s-2.72239,2.392568 -4.386417,2.159142a6.694367,6.808124 0 0 0 2.065704,-6.360726a2.620361,2.664889 0 0 0 -0.573815,-1.296794c-0.873449,-0.946655 -2.448224,-0.538167 -3.49381,0.207496c-3.315306,2.373113 -4.239776,6.950767 -4.258892,11.074534c-0.33154,-1.484807 -0.051007,-3.034468 -0.057389,-4.538745s-0.420793,-3.241965 -1.689524,-4.032998a5.043089,5.128785 0 0 0 -2.550239,-0.64839c-1.49189,-0.051874 -3.155917,0.097259 -4.169639,1.206011c-1.275112,1.374584 -0.937205,3.689348 0.159389,5.187135s2.773383,2.463897 4.31628,3.514286a9.646269,9.810187 0 0 1 3.08578,2.989098a2.996528,3.047448 0 0 1 0.223145,0.531677l9.346606,0a25.782876,26.221003 0 0 0 5.76353,-4.032998l0,0z"/>
   <path stroke="null" id="svg_909" fill="#a8a8a8" d="m272.706266,555.205679s9.786529,-0.304755 12.751178,-2.444442s15.06551,-4.687877 15.798699,-1.257885s14.714854,17.04624 3.65958,17.137024s-25.687228,-1.750667 -28.632749,-3.579139s-3.576709,-9.855557 -3.576709,-9.855557z"/>
   <path stroke="null" id="svg_910" opacity="0.2" d="m305.100624,567.447329c-11.055274,0.090769 -25.687243,-1.750667 -28.632763,-3.579125c-2.244209,-1.387563 -3.136787,-6.373706 -3.436436,-8.67549l-0.325159,0s0.637556,8.033576 3.563947,9.855557s17.577504,3.669908 28.632763,3.579125c3.187795,0 4.290769,-1.180067 4.233395,-2.891825c-0.446303,1.043914 -1.664041,1.692304 -4.035747,1.711758z"/>
  </g>
 </g>
</svg>