<svg width="1079.94368" height="779.70903" xmlns="http://www.w3.org/2000/svg">
 <title>begin chat</title>
 <g>
  <title>background</title>
  <rect fill="none" id="canvas_background" height="781.70903" width="1081.94368" y="-1" x="-1"/>
 </g>
 <g>
  <title>Layer 1</title>

  <g stroke="null" id="svg_2">
   <g stroke="null" id="svg_278" transform="matrix(-1.1107891100735607,0,0,-1.1107891100735607,9071.130332674536,6977.752252724519) ">
    <title stroke="null" transform="translate(6.301826477050781,-21.60626220703125) translate(31.20182228088379,97.07233428955078) translate(104.0885009765625,273.3637390136719) translate(-1257.16259765625,-453.6717529296875) translate(985.6884155273438,194.95130920410156) ">Layer 1</title>
    <path stroke="null" id="svg_274" fill="#f9a826" d="m7972.308577,5874.159744c0,35.17 -8.33,64.12 -22.7799,88.92a177.67758,177.67758 0 0 1 -16.19,23.25c-53.12,64.97 -151.88,100.53 -241.14,158.13c-263.48,170.02 -292.02,-102.42 -280.12,-270.3c4.8,-67.74 31.18,-129.79 73.09,-177.3a278.22062,278.22062 0 0 1 28.45,-27.97c47.58,-40.52 109.05,-65.04 178.58,-65.04c119.29,0 221.16,71.95 261.55,173.34a261.84957,261.84957 0 0 1 18.55993,96.97l-0.00003,0z"/>
    <path stroke="null" id="svg_273" fill="#d0cde1" d="m7751.878687,5664.769724l-266.71,32.09a278.22062,278.22062 0 0 1 28.45,-27.97l238.26,-4.12z"/>
    <path stroke="null" id="svg_272" fill="#d0cde1" d="m7949.528687,5963.079724a177.67758,177.67758 0 0 1 -16.19,23.25l-228.46,-27.48l244.65,4.23z"/>
    <path stroke="null" id="svg_271" fill="#d0cde1" d="m7963.068587,5805.069714l-387.18994,-50.22l377.87,22.34a260.439,260.439 0 0 1 9.31994,27.88z"/>
    <path stroke="null" id="svg_270" fill="#f9a826" d="m7438.343217,5675.851884c0,0.69 -0.02,1.37 -0.08,2.04a27.99706,27.99706 0 1 1 -52.68,-15.11a25.73956,25.73956 0 0 1 2.06,-3.31a27.9889,27.9889 0 0 1 50.6,14.1c0.06997,0.74997 0.1,1.50998 0.1,2.28z"/>
    <path stroke="null" id="svg_269" fill="#d0cde1" d="m7438.343217,5675.851884c0,0.69 -0.02,1.37 -0.08,2.04l-41.92,-5.04l41.9,0.72c0.06997,0.74997 0.1,1.50998 0.1,2.28z"/>
    <path stroke="null" id="svg_268" fill="#d0cde1" d="m7428.343217,5689.961864l-38.78,4.67a28.05694,28.05694 0 0 1 -2.96,-3.95l41.74,-0.72z"/>
    <path stroke="null" id="svg_267" fill="#d0cde1" d="m7417.343217,5658.961864l-31.76,3.82a25.73956,25.73956 0 0 1 2.06,-3.31l29.7,-0.51z"/>
    <path stroke="null" id="svg_266" fill="#f9a826" d="m7822.076117,6179.977574c-0.32346,0.60949 -0.65991,1.20075 -1.027,1.76443a27.99706,27.99706 0 1 1 -39.45,-38.042a25.73938,25.73938 0 0 1 3.37127,-1.9581a27.98891,27.98891 0 0 1 38.08621,36.17477c-0.28977,0.69535 -0.61952,1.38072 -0.98048,2.0609z"/>
    <path stroke="null" id="svg_265" fill="#d0cde1" d="m7822.076117,6179.977574c-0.32346,0.60949 -0.65991,1.20075 -1.027,1.76443l-34.66603,-24.10292l36.67354,20.27763c-0.2898,0.69531 -0.61955,1.38068 -0.98051,2.06086z"/>
    <path stroke="null" id="svg_264" fill="#d0cde1" d="m7806.628537,6187.753424l-36.44426,-14.054a28.05745,28.05745 0 0 1 -0.76292,-4.87668l37.20718,18.93068z"/>
    <path stroke="null" id="svg_263" fill="#d0cde1" d="m7811.444047,6155.214024l-29.8449,-11.514a25.73938,25.73938 0 0 1 3.37127,-1.9581l26.47363,13.4721z"/>
    <path stroke="null" id="svg_262" fill="#f9a826" d="m8020.388497,5697.302284c0.48176,0.494 0.9422,0.99477 1.367,1.5163a27.99707,27.99707 0 1 1 -48.26355,25.96387a25.73851,25.73851 0 0 1 -0.83628,-3.80793a27.9889,27.9889 0 0 1 46.06931,-25.23471c0.57376,0.48809 1.1259,1.01121 1.66352,1.56247z"/>
    <path stroke="null" id="svg_261" fill="#d0cde1" d="m8020.388497,5697.302284c0.48176,0.494 0.9422,0.99477 1.367,1.5163l-33.52955,25.66038l30.499,-28.73915c0.57379,0.48809 1.12593,1.01121 1.66355,1.56247z"/>
    <path stroke="null" id="svg_260" fill="#d0cde1" d="m8023.081057,5714.385664l-24.50216,30.41946a28.0572,28.0572 0 0 1 -4.87694,-0.76118l29.3791,-29.65828z"/>
    <path stroke="null" id="svg_259" fill="#d0cde1" d="m7993.561937,5699.872864l-20.07,24.90959a25.73851,25.73851 0 0 1 -0.83628,-3.80793l20.90628,-21.10166z"/>
   </g>
   <g stroke="null" id="svg_297" transform="matrix(0.8882492584770035,0,0,0.8882492584770035,-5101.4117254389885,-4134.664632645535) ">
    <title stroke="null" transform="translate(-7.88067102432251,27.01944351196289) translate(-39.01905059814453,-121.39260864257812) translate(-130.1665802001953,-341.8516540527344) translate(-1572.129150390625,-567.3335571289062) translate(1232.640380859375,243.7939453125) ">Layer 1</title>
    <path stroke="null" id="svg_281" fill="#333333" d="m6674.318395,5156.2523c0,35.17 -8.33,64.12 -22.7799,88.92a177.67758,177.67758 0 0 1 -16.19,23.25c-53.12,64.97 -151.88,100.53 -241.14,158.13c-263.48,170.02 -292.02,-102.42 -280.12,-270.3c4.8,-67.74 31.18,-129.79 73.09,-177.3a278.22062,278.22062 0 0 1 28.45,-27.97c47.58,-40.52 109.05,-65.04 178.58,-65.04c119.29,0 221.16,71.95 261.55,173.34a261.84957,261.84957 0 0 1 18.55993,96.97l-0.00003,0z"/>
    <path stroke="null" id="svg_282" fill="#333333" d="m6453.888505,4946.86228l-266.71,32.09a278.22062,278.22062 0 0 1 28.45,-27.97l238.26,-4.12z"/>
    <path stroke="null" id="svg_283" fill="#333333" d="m6651.538505,5245.17228a177.67758,177.67758 0 0 1 -16.19,23.25l-228.46,-27.48l244.65,4.23z"/>
    <path stroke="null" id="svg_284" fill="#333333" d="m6665.078405,5087.16227l-387.18994,-50.22l377.87,22.34a260.439,260.439 0 0 1 9.31994,27.88z"/>
    <path stroke="null" id="svg_285" fill="#333333" d="m6140.353035,4957.94444c0,0.69 -0.02,1.37 -0.08,2.04a27.99706,27.99706 0 1 1 -52.68,-15.11a25.73956,25.73956 0 0 1 2.06,-3.31a27.9889,27.9889 0 0 1 50.6,14.1c0.06997,0.74997 0.1,1.50998 0.1,2.28z"/>
    <path stroke="null" id="svg_286" fill="#333333" d="m6140.353035,4957.94444c0,0.69 -0.02,1.37 -0.08,2.04l-41.92,-5.04l41.9,0.72c0.06997,0.74997 0.1,1.50998 0.1,2.28z"/>
    <path stroke="null" id="svg_287" fill="#333333" d="m6130.353035,4972.05442l-38.78,4.67a28.05694,28.05694 0 0 1 -2.96,-3.95l41.74,-0.72z"/>
    <path stroke="null" id="svg_288" fill="#333333" d="m6119.353035,4941.05442l-31.76,3.82a25.73956,25.73956 0 0 1 2.06,-3.31l29.7,-0.51z"/>
    <path stroke="null" id="svg_289" fill="#333333" d="m6524.085935,5462.07013c-0.32346,0.60949 -0.65991,1.20075 -1.027,1.76443a27.99706,27.99706 0 1 1 -39.45,-38.042a25.73938,25.73938 0 0 1 3.37127,-1.9581a27.98891,27.98891 0 0 1 38.08621,36.17477c-0.28977,0.69535 -0.61952,1.38072 -0.98048,2.0609z"/>
    <path stroke="null" id="svg_290" fill="#333333" d="m6524.085935,5462.07013c-0.32346,0.60949 -0.65991,1.20075 -1.027,1.76443l-34.66603,-24.10292l36.67354,20.27763c-0.2898,0.69531 -0.61955,1.38068 -0.98051,2.06086z"/>
    <path stroke="null" id="svg_291" fill="#333333" d="m6508.638355,5469.84598l-36.44426,-14.054a28.05745,28.05745 0 0 1 -0.76292,-4.87668l37.20718,18.93068z"/>
    <path stroke="null" id="svg_292" fill="#333333" d="m6513.453865,5437.30658l-29.8449,-11.514a25.73938,25.73938 0 0 1 3.37127,-1.9581l26.47363,13.4721z"/>
    <path stroke="null" id="svg_293" fill="#333333" d="m6722.398315,4979.39484c0.48176,0.494 0.9422,0.99477 1.367,1.5163a27.99707,27.99707 0 1 1 -48.26355,25.96387a25.73851,25.73851 0 0 1 -0.83628,-3.80793a27.9889,27.9889 0 0 1 46.06931,-25.23471c0.57376,0.48809 1.1259,1.01121 1.66352,1.56247z"/>
    <path stroke="null" id="svg_294" fill="#333333" d="m6722.398315,4979.39484c0.48176,0.494 0.9422,0.99477 1.367,1.5163l-33.52955,25.66038l30.499,-28.73915c0.57379,0.48809 1.12593,1.01121 1.66355,1.56247z"/>
    <path stroke="null" id="svg_295" fill="#333333" d="m6725.090875,4996.47822l-24.50216,30.41946a28.0572,28.0572 0 0 1 -4.87694,-0.76118l29.3791,-29.65828z"/>
    <path stroke="null" id="svg_296" fill="#333333" d="m6695.571755,4981.96542l-20.07,24.90959a25.73851,25.73851 0 0 1 -0.83628,-3.80793l20.90628,-21.10166z"/>
   </g>
   <path stroke="null" id="svg_66" fill="#a0616a" d="m480.098521,290.310491s-3.999335,-53.858465 -2.116392,-63.708913s3.65159,-37.890199 -6.701127,-28.672931s-6.674811,30.129787 -6.674811,30.129787s-9.824144,56.919807 -0.737813,64.642078s16.230144,-2.390022 16.230144,-2.390022z"/>
   <path stroke="null" id="svg_67" fill="#f9a826" d="m487.554678,343.571774s-30.815325,-27.483945 -29.149636,-50.803652c0,0 18.322628,-14.158388 22.486856,-6.66277s34.432732,36.737626 29.292638,46.685589s-22.62986,10.780832 -22.62986,10.780832l0.000002,0z"/>
   <path stroke="null" id="svg_68" fill="#a0616a" d="m596.65759,294.433821s18.322628,-50.803652 19.155477,-60.797811s6.66278,-37.478105 14.158398,-25.818246s-1.665701,30.815335 -1.665701,30.815335s-5.829919,57.466422 -16.656927,62.4635s-14.991248,-6.66278 -14.991248,-6.66278l0.000002,0.000002z"/>
   <path stroke="null" id="svg_69" fill="#a0616a" d="m546.686788,549.284861l49.137963,0l2.498539,24.985396l-11.659858,2.498539s-27.483935,-8.328501 -43.307991,-5.829929s3.331347,-21.654006 3.331347,-21.654006z"/>
   <path stroke="null" id="svg_70" fill="#cccccc" d="m579.167812,545.953521s23.319707,-15.824087 27.483945,-2.498539s19.155466,61.63065 14.158388,66.627728s-10.827008,-4.164228 -10.827008,-4.164228s-9.994157,-20.821167 -17.489745,-21.654016s-11.659858,-7.495618 -11.659858,-7.495618s21.653986,-16.656937 -1.665721,-30.815325l0,-0.000002z"/>
   <path stroke="null" id="svg_71" fill="#a0616a" d="m534.19409,675.044762s9.161319,37.478094 7.495618,43.307991s26.651097,2.498539 26.651097,2.498539l1.665701,-10.827008s-16.656937,-26.651085 -16.656937,-38.310943s-19.155477,3.33142 -19.155477,3.33142l-0.000002,0z"/>
   <path stroke="null" id="svg_72" fill="#cccccc" d="m568.340804,702.528697s22.486866,16.656937 10.827008,24.985406s-54.967882,29.982474 -54.967882,29.982474s-15.824087,2.498539 -4.164228,-11.659848s14.991238,-16.656937 15.824087,-24.152557a36.559992,36.559992 0 0 1 5.135731,-14.060987s11.521196,23.222306 27.345282,-5.09449l0.000002,0.000002z"/>
   <path stroke="null" id="svg_73" fill="#999999" d="m500.047375,502.64549s-9.161309,86.616056 4.997079,114.100003s30.815335,64.96204 29.982484,66.627741s24.152557,-2.498539 24.152557,-9.99417s-27.483945,-82.451817 -27.483945,-82.451817s11.659858,-97.443065 20.821167,-104.105843s-52.469341,15.824087 -52.469341,15.824087l-0.000002,0z"/>
   <path stroke="null" id="svg_75" fill="#2f2e41" d="m518.871243,258.204982c-5.953187,1.077853 -11.851141,4.348411 -14.811688,9.934179c-2.761593,5.210449 -2.937241,12.175119 -7.330755,15.916782c-2.622744,2.233622 -6.183575,2.750144 -9.111895,4.50478a14.033487,14.033487 0 0 0 -6.455009,12.499058c0.234481,4.595019 2.657928,8.875125 2.606494,13.476555c-0.066859,5.982239 -4.20343,10.921462 -8.09402,15.251189l12.902816,2.394373a12.844335,12.844335 0 0 0 5.969132,0.158274c2.228635,-0.659754 4.038818,-2.494803 6.291676,-3.054336c3.230565,-0.802351 6.427246,1.162721 9.309745,2.906282c8.205098,4.962894 17.002976,8.70869 25.76901,12.438298c2.57891,1.097236 5.502888,2.195606 8.047666,1.012016c2.055207,-0.955899 3.3334,-3.190343 5.266535,-4.39947c3.461767,-2.165275 7.808648,-0.535435 11.698716,0.533498a38.672334,38.672334 0 0 0 26.422112,-2.249934c-1.782148,-2.081709 -4.117929,-3.537578 -6.038396,-5.475804s-3.474175,-4.682883 -2.966813,-7.443343c0.517406,-2.815087 2.937688,-4.694314 4.587326,-6.966263a16.367621,16.367621 0 0 0 2.490284,-12.41213a22.64408,22.64408 0 0 0 -5.94108,-11.243391a59.386524,59.386524 0 0 1 -4.859833,-5.124509c-3.035463,-4.09912 -3.786911,-9.525896 -4.757957,-14.636364s-2.504212,-10.549245 -6.445839,-13.66104c-6.279529,-4.957523 -16.47692,-3.267684 -23.818,-3.759754c-6.999073,-0.469191 -13.747313,-0.598952 -20.730231,-0.598952l0.000002,0.000004z"/>
   <path stroke="null" id="svg_76" fill="#b2b2b2" d="m477.560519,443.513379l15.824087,39.143793s-72.45767,79.120437 -31.648175,89.947445s54.967882,-8.328501 80.786126,6.66277c0,0 12.492699,-19.155477 10.827008,-30.815325c0,0 -35.812404,-6.66278 -54.967882,-5.829929c0,0 51.636492,-44.973723 56.633571,-46.639414s21.654016,-28.316786 -4.164228,-49.970801s-19.155499,-33.313864 -19.155499,-33.313864l-54.135011,30.815325l0.000004,0z"/>
   <path stroke="null" id="svg_77" fill="#a0616a" d="m515.038613,307.759401s2.498549,25.818246 -8.328501,29.149636s42.475173,2.498539 42.475173,2.498539s-12.492699,-7.495618 -6.66277,-23.319707s-27.483905,-8.328469 -27.483905,-8.328469l0.000002,0z"/>
   <path stroke="null" id="svg_78" opacity="0.1" d="m515.038613,307.759401s2.498549,25.818246 -8.328501,29.149636s42.475173,2.498539 42.475173,2.498539s-12.492699,-7.495618 -6.66277,-23.319707s-27.483905,-8.328469 -27.483905,-8.328469l0.000002,0z"/>
   <path stroke="null" id="svg_79" fill="#f9a826" d="m571.672194,352.733083s-4.997079,-25.818246 -14.991238,-24.152545s-29.982484,3.33138 -32.481026,4.997079s-15.824087,5.079147 -15.824087,5.079147s4.997079,-5.911996 0,-6.744846s-20.821167,3.33139 -22.486856,6.66278s-8.328501,9.994157 -8.328501,21.654006s-4.997079,31.648175 -3.33139,39.976644s-0.832851,27.483945 -5.829929,38.310955s-0.83284,21.654006 7.495618,10.827008s4.16424,0 10.827008,0.83284s36.645284,-29.982517 44.973733,-22.486856s16.656937,12.492699 18.322628,8.328501s-6.66277,-11.659858 -6.66277,-14.991248s-13.325547,10.827008 0.83284,-18.322628s0.832871,-37.478125 27.483967,-49.970834l0.000002,-0.000002z"/>
   <path stroke="null" id="svg_80" fill="#f9a826" d="m565.009414,351.067392l6.66278,1.665689s24.152557,-17.489745 30.815325,-29.982474s11.659858,-22.486866 11.659858,-22.486866s-10.827008,-13.325547 -17.489745,-8.328501s-36.645254,39.143804 -36.645254,39.143804l4.997038,19.988347l-0.000002,0.000002z"/>
   <circle stroke="null" id="svg_81" fill="#a0616a" r="25.818243" cy="299.4309" cx="534.19409"/>
   <path stroke="null" id="svg_82" fill="#2f2e41" d="m511.354431,291.951707a22.675358,22.675358 0 0 1 15.769168,-5.186155c9.896706,0.609009 18.608591,7.6612 28.521546,7.881554a10.221456,10.221456 0 0 1 0.852451,-6.318969c0.76873,-1.575357 1.981935,-3.101823 1.818737,-4.847101a5.912018,5.912018 0 0 0 -2.138346,-3.501873c-5.730001,-5.433323 -13.652432,-8.233608 -21.541335,-8.578563c-5.289113,-0.231285 -15.384116,-0.105956 -19.486193,3.898979c-3.509535,3.426447 -3.101489,12.210563 -3.796031,16.652129l0.000002,0z"/>
   <g stroke="null" transform="matrix(1.431063801158039,1.431063801158039,-1.431063801158039,1.431063801158039,350.4516449542762,-619.0314579523449) " id="svg_808">
    <g stroke="null" transform="matrix(0.232913012248781,0,0,0.232913012248781,-1881.923914472749,-1387.35578322271) " id="svg_806">
     <title stroke="null" transform="translate(25.50152587890625,46.502784729003906) translate(-213.74110412597656,-109.75894927978516) translate(-628.9424438476562,-282.0605163574219) translate(-2962.4794921875,-1069.068603515625) translate(2322.755615234375,459.39898681640625) ">background</title>
     <rect stroke="null" x="8884.789108" y="6305.323366" width="582" height="402" id="svg_804" fill="none"/>
    </g>
    <g stroke="null" transform="matrix(0.232913012248781,0,0,0.232913012248781,-1881.923914472749,-1387.35578322271) " id="svg_807">
     <title stroke="null" transform="translate(25.50152587890625,46.502784729003906) translate(-213.74110412597656,-109.75894927978516) translate(-628.9424438476562,-282.0605163574219) translate(-2962.4794921875,-1069.068603515625) translate(2322.755615234375,459.39898681640625) ">Layer 1</title>
     <path stroke="null" d="m9725.696819,6686.891366l-208.72132,0l0,-4.30193l-94.64237,0l0,4.30193l-209.58169,0a14.11841,14.11841 0 0 0 -14.11843,14.11842l0,285.80366a14.11846,14.11846 0 0 0 14.11843,14.11848l512.94538,0a14.11846,14.11846 0 0 0 14.11843,-14.11848l0,-285.80366a14.11841,14.11841 0 0 0 -14.11843,-14.11842z" fill="#3f3d56" id="svg_803"/>
     <rect stroke="null" x="9217.561488" y="6711.842536" width="503.32529" height="283.92709" fill="#f2f2f2" id="svg_802"/>
     <circle stroke="null" cx="9468.793938" cy="6698.936756" r="5.16231" fill="#f9a826" id="svg_801"/>
     <path stroke="null" d="m9753.947529,6990.607286l-49.12128,0l0,-3.53915a0.70171,0.70171 0 0 0 -0.70173,-0.70174l-16.84158,0a0.70171,0.70171 0 0 0 -0.70173,0.70174l0,3.53915l-10.526,0l0,-3.53915a0.70171,0.70171 0 0 0 -0.70173,-0.70174l-16.84158,0a0.70171,0.70171 0 0 0 -0.70173,0.70174l0,3.53915l-10.526,0l0,-3.53915a0.70171,0.70171 0 0 0 -0.70173,-0.70174l-16.84157,0a0.70171,0.70171 0 0 0 -0.70173,0.70174l0,3.53915l-10.52601,0l0,-3.53915a0.70171,0.70171 0 0 0 -0.70173,-0.70174l-16.84156,0a0.70171,0.70171 0 0 0 -0.70174,0.70174l0,3.53915l-10.52597,0l0,-3.53915a0.70171,0.70171 0 0 0 -0.70174,-0.70174l-16.84159,0a0.70171,0.70171 0 0 0 -0.70173,0.70174l0,3.53915l-10.526,0l0,-3.53915a0.70171,0.70171 0 0 0 -0.70173,-0.70174l-16.84157,0a0.70171,0.70171 0 0 0 -0.70173,0.70174l0,3.53915l-10.526,0l0,-3.53915a0.70171,0.70171 0 0 0 -0.70173,-0.70174l-131.92571,0a0.70171,0.70171 0 0 0 -0.70173,0.70174l0,3.53915l-10.526,0l0,-3.53915a0.70171,0.70171 0 0 0 -0.70173,-0.70174l-16.84157,0a0.70171,0.70171 0 0 0 -0.70174,0.70174l0,3.53915l-10.526,0l0,-3.53915a0.70172,0.70172 0 0 0 -0.70174,-0.70174l-16.84156,0a0.70171,0.70171 0 0 0 -0.70173,0.70174l0,3.53915l-10.526,0l0,-3.53915a0.70171,0.70171 0 0 0 -0.70173,-0.70174l-16.84157,0a0.70171,0.70171 0 0 0 -0.70173,0.70174l0,3.53915l-10.526,0l0,-3.53915a0.70171,0.70171 0 0 0 -0.70174,-0.70174l-16.84157,0a0.70171,0.70171 0 0 0 -0.70173,0.70174l0,3.53915l-10.526,0l0,-3.53915a0.70171,0.70171 0 0 0 -0.70173,-0.70174l-16.84157,0a0.70171,0.70171 0 0 0 -0.70173,0.70174l0,3.53915l-10.526,0l0,-3.53915a0.70171,0.70171 0 0 0 -0.70173,-0.70174l-16.84157,0a0.70171,0.70171 0 0 0 -0.70174,0.70174l0,3.53915l-32.27969,0a16.84159,16.84159 0 0 0 -16.84158,16.84158l0,7.61537a16.84158,16.84158 0 0 0 16.84158,16.84154l559.98256,0a16.84158,16.84158 0 0 0 16.8416,-16.84154l0,-7.61537a16.84159,16.84159 0 0 0 -16.8416,-16.84158z" fill="#3f3d56" id="svg_800"/>
     <rect stroke="null" x="9420.577578" y="6734.079866" width="141.24028" height="5.24823" fill="#e6e6e6" id="svg_799"/>
     <rect stroke="null" x="9420.577578" y="6750.699256" width="141.24028" height="5.24823" fill="#e6e6e6" id="svg_798"/>
     <rect stroke="null" x="9420.577578" y="6767.318636" width="141.24028" height="5.24823" fill="#e6e6e6" id="svg_797"/>
     <rect stroke="null" x="9420.577578" y="6734.079866" width="141.24028" height="5.24823" fill="#ccc" id="svg_796"/>
     <rect stroke="null" x="9420.577578" y="6750.699256" width="141.24028" height="5.24823" fill="#ccc" id="svg_795"/>
     <rect stroke="null" x="9420.577578" y="6767.318636" width="141.24028" height="5.24823" fill="#ccc" id="svg_794"/>
     <rect stroke="null" x="9375.789108" y="6737.323366" width="32" height="32" fill="#ccc" id="svg_793"/>
     <rect stroke="null" x="9420.577578" y="6921.079866" width="141.24028" height="5.24823" fill="#ccc" id="svg_792"/>
     <rect stroke="null" x="9420.577578" y="6937.699256" width="141.24028" height="5.24823" fill="#ccc" id="svg_791"/>
     <rect stroke="null" x="9420.577578" y="6954.318636" width="141.24028" height="5.24823" fill="#ccc" id="svg_790"/>
     <rect stroke="null" x="9375.789108" y="6924.323366" width="32" height="32" fill="#ccc" id="svg_789"/>
     <circle stroke="null" cx="9468.789108" cy="6844.354866" r="56" fill="#f9a826" id="svg_788"/>
     <polygon stroke="null" points="9489.622619628906,6856.670753479004 9468.734924316406,6814.483253479004 9447.953674316406,6856.723976135254 9459.696838378906,6856.709327697754 9459.696838378906,6874.227394104004 9477.871643066406,6874.227394104004 9477.871643066406,6856.685401916504 9489.622619628906,6856.670753479004 " fill="#d0cde1" id="svg_787"/>
    </g>
   </g>
  </g>
 </g>
</svg>