{
    "facebook": [{
        "content": "Besoin d'un développeur Web pour la création d'un site Web vitrine et un site Web E-Commerce avec possibilité de partenariat par la suite. Contact : imene.yazidi.86@gmail.com"
    }, {
        "content": "Besoin d'un développeur Web pour la création d'un site Web vitrine et un site Web E-Commerce avec possibilité de partenariat par la suite. Contact : imene.yazidi.86@gmail.com\n"
    }]
}