date,sludge,Tank A,Tank B,Tank C,Tank D,Tank E,qBiogas,objective,objectiveMod
23/8/2021 10:54:05,1234,1234,1234,1234,1234,1234,975.10969255642,15,54.586709886547816
23/8/2021 10:54:10,1234,1234,1234,1234,1234,1234,975.10969255642,15,54.586709886547816
23/8/2021 10:54:15,1234,1234,1234,1234,1234,1234,975.10969255642,15,54.18152350081038