<?xml version="1.0" encoding="UTF-8" standalone="no"?>
<svg
   xmlns:dc="http://purl.org/dc/elements/1.1/"
   xmlns:cc="http://creativecommons.org/ns#"
   xmlns:rdf="http://www.w3.org/1999/02/22-rdf-syntax-ns#"
   xmlns:svg="http://www.w3.org/2000/svg"
   xmlns="http://www.w3.org/2000/svg"
   xmlns:sodipodi="http://sodipodi.sourceforge.net/DTD/sodipodi-0.dtd"
   xmlns:inkscape="http://www.inkscape.org/namespaces/inkscape"
   width="100%"
   height="100%"
   viewBox="0 0 11 11"
   id="jh_logo"
   shape-rendering="crispEdges"
   version="1.1"
   sodipodi:docname="logo.svg"
   inkscape:version="0.92.3 (2405546, 2018-03-11)">
  <metadata
     id="metadata14">
    <rdf:RDF>
      <cc:Work
         rdf:about="">
        <dc:format>image/svg+xml</dc:format>
        <dc:type
           rdf:resource="http://purl.org/dc/dcmitype/StillImage" />
        <dc:title></dc:title>
      </cc:Work>
    </rdf:RDF>
  </metadata>
  <defs
     id="defs12" />
  <sodipodi:namedview
     pagecolor="#ffffff"
     bordercolor="#666666"
     borderopacity="1"
     objecttolerance="10"
     gridtolerance="10"
     guidetolerance="10"
     inkscape:pageopacity="0"
     inkscape:pageshadow="2"
     inkscape:window-width="1853"
     inkscape:window-height="1029"
     id="namedview10"
     showgrid="false"
     inkscape:zoom="37.36403"
     inkscape:cx="-0.142683"
     inkscape:cy="4.8704062"
     inkscape:window-x="67"
     inkscape:window-y="27"
     inkscape:window-maximized="0"
     inkscape:current-layer="face" />
  <g
     id="face"
     style="fill:#2aabff;fill-opacity:1">
    <path
       d="M 2,6 V 7 H 3 V 6 Z M 8,6 V 7 H 9 V 6 Z M 4,7 V 9 H 7 V 7 H 6 V 8 H 5 V 7 Z"
       id="left_eye"
       style="fill:#000000;fill-opacity:1"
       inkscape:connector-curvature="0"
       sodipodi:nodetypes="ccccccccccccccccccc" />
    <path
       inkscape:connector-curvature="0"
       d="M 1,0 V 1 H 0 v 4 4 h 1 v 1 h 1 v 1 h 7 v -1 h 1 V 9 h 1 V 5 1 H 10 V 0 H 8 V 1 H 7 V 2 H 4 V 1 H 3 V 0 Z m 1,4 h 7 v 1 h 1 V 8 H 9 V 9 H 8 v 1 H 3 V 9 H 2 V 8 H 1 V 5 h 1 z"
       id="left_eye-3"
       style="fill:#2aabff;fill-opacity:1"
       sodipodi:nodetypes="cccccccccccccccccccccccccccccccccccccccccccc" />
  </g>
  <g
     id="head" />
</svg>
