{700C00BA-E947-4B77-8EF1-588DF210E931}
SQL Server 2014 Reporting Services
Microsoft Corporation
12.0.2000.8
SQL Server 2014 Reporting Services

{026E123D-2160-46C7-A801-87D27D46835E}
SQL Server 2014 Reporting Services
Microsoft Corporation
12.0.2000.8
SQL Server 2014 Reporting Services

{700C00BA-E947-4B77-8EF1-588DF210E931}
SQL Server 2014 Reporting Services
Microsoft Corporation
12.0.2000.8
SQL Server 2014 Reporting Services

{026E123D-2160-46C7-A801-87D27D46835E}
SQL Server 2014 Reporting Services
Microsoft Corporation
12.0.2000.8
SQL Server 2014 Reporting Services