\relax 
\providecommand*\new@tpo@label[2]{}
\@writefile{toc}{\contentsline {section}{\numberline {1}Random permutation Definition}{1}\protected@file@percent }
\@writefile{toc}{\contentsline {section}{\numberline {2}Algorithm Analysis}{1}\protected@file@percent }
