\relax 
\providecommand*\new@tpo@label[2]{}
\@writefile{toc}{\contentsline {section}{\numberline {1}Week 1: Chapter 10 Problem 7}{1}\protected@file@percent }
\@writefile{toc}{\contentsline {subsection}{\numberline {1.1}Prove that the value of the max flow is at most E/d}{1}\protected@file@percent }
\@writefile{toc}{\contentsline {section}{\numberline {2}Week 1: Chapter 10 Problem 14}{1}\protected@file@percent }
\@writefile{toc}{\contentsline {subsection}{\numberline {2.1}INCREMENT(e): Increase the capacity of edge e by 1 and update the maximum flow}{1}\protected@file@percent }
\@writefile{toc}{\contentsline {subsection}{\numberline {2.2}DECREMENT(e): Decrease the capacity of edge e by 1 and update the maximum flow}{1}\protected@file@percent }
