module golf-interfaces

go 1.18

require (
	github.com/davecgh/go-spew v1.1.1 // indirect
	github.com/maxatome/go-testdeep v1.11.0 // indirect
	github.com/pmezard/go-difflib v1.0.0 // indirect
	github.com/stretchr/objx v0.1.0 // indirect
	github.com/stretchr/testify v1.7.1 // indirect
	gopkg.in/yaml.v3 v3.0.0-20200313102051-9f266ea9e77c // indirect
)
