[{"id":1,"repository_id":1,"created_at":"2020-04-15T12:04:28.95584","schema_version":2,"digest":"01a2490cec4484ee6c1068ba3a05f89934010c85242f736280b35343483b2264b6","payload":{
   "schemaVersion": 2,
   "mediaType": "application/vnd.docker.distribution.manifest.v2+json",
   "config": {
      "mediaType": "application/vnd.docker.container.image.v1+json",
      "size": 1494,
      "digest": "sha256:be5888e67be651f1fbb59006f0fd791b44ed3fceaa6323ab4e37d5928874345a"
   },
   "layers": [
      {
         "mediaType": "application/vnd.docker.image.rootfs.diff.tar.gzip",
         "size": 760854,
         "digest": "sha256:e2334dd9fee4b77e48a8f2d793904118a3acf26f1f2e72a3d79c6cae993e07f0"
      }
   ]
},"media_type_id":3,"configuration_media_type_id":8,"configuration_payload":{"architecture":"amd64","config":{"Hostname":"","Domainname":"","User":"","AttachStdin":false,"AttachStdout":false,"AttachStderr":false,"Tty":false,"OpenStdin":false,"StdinOnce":false,"Env":["PATH=/usr/local/sbin:/usr/local/bin:/usr/sbin:/usr/bin:/sbin:/bin"],"Cmd":["sh"],"ArgsEscaped":true,"Image":"sha256:b0acc7ebf5092fcdd0fe097448529147e6619bd051f03ccf25b29bcae87e783f","Volumes":null,"WorkingDir":"","Entrypoint":null,"OnBuild":null,"Labels":null},"container":"f7e67f16a539f8bbf53aae18cdb5f8c53e6a56930e7660010d9396ae77f7acfa","container_config":{"Hostname":"f7e67f16a539","Domainname":"","User":"","AttachStdin":false,"AttachStdout":false,"AttachStderr":false,"Tty":false,"OpenStdin":false,"StdinOnce":false,"Env":["PATH=/usr/local/sbin:/usr/local/bin:/usr/sbin:/usr/bin:/sbin:/bin"],"Cmd":["/bin/sh","-c","#(nop) ","CMD [\"sh\"]"],"ArgsEscaped":true,"Image":"sha256:b0acc7ebf5092fcdd0fe097448529147e6619bd051f03ccf25b29bcae87e783f","Volumes":null,"WorkingDir":"","Entrypoint":null,"OnBuild":null,"Labels":{}},"created":"2020-04-14T19:19:53.590635493Z","docker_version":"18.09.7","history":[{"created":"2020-04-14T19:19:53.444488372Z","created_by":"/bin/sh -c #(nop) ADD file:09a89925137e1b768ef1f0e7d1d7325eb2b4f1a0895b3aa8dfc98b0c75f3f507 in / "},{"created":"2020-04-14T19:19:53.590635493Z","created_by":"/bin/sh -c #(nop)  CMD [\"sh\"]","empty_layer":true}],"os":"linux","rootfs":{"type":"layers","diff_ids":["sha256:5b0d2d635df829f65d0ffb45eab2c3124a470c4f385d6602bda0c21c5248bcab"]}},"configuration_blob_digest":"01be5888e67be651f1fbb59006f0fd791b44ed3fceaa6323ab4e37d5928874345a"}, 
 {"id":2,"repository_id":2,"created_at":"2020-04-15T12:04:28.95584","schema_version":2,"digest":"01cda5d02e4ea900a8d52e834bc3158e83b8a87a5b44ae081885aecf9b156dcff1","payload":{
   "schemaVersion": 2,
   "mediaType": "application/vnd.docker.distribution.manifest.v2+json",
   "config": {
      "mediaType": "application/vnd.docker.container.image.v1+json",
      "size": 5528,
      "digest": "sha256:5c5637d8a82384db15453cd807664167553ad6dd5c261438a0e93e279b2dbb68"
   },
   "layers": [
      {
         "mediaType": "application/vnd.docker.image.rootfs.diff.tar.gzip",
         "size": 2803255,
         "digest": "sha256:aad63a9339440e7c3e1fff2b988991b9bfb81280042fa7f39a5e327023056819"
      },
      {
         "mediaType": "application/vnd.docker.image.rootfs.diff.tar.gzip",
         "size": 1228,
         "digest": "sha256:541cb024bf66c36eab08a7896d96ba1e929b45e33b9242d912e4c982a8e6d2c8"
      },
      {
         "mediaType": "application/vnd.docker.image.rootfs.diff.tar.gzip",
         "size": 402572,
         "digest": "sha256:270420c343f3239793a3aa2928f17b524d4061b0d21d3f634b9ccaca25eba02d"
      },
      {
         "mediaType": "application/vnd.docker.image.rootfs.diff.tar.gzip",
         "size": 6781145,
         "digest": "sha256:8dd6c66eb1b07a8ca5d7a27c0e926ff8381c20cdf6dac0ac7fa2d76b836f2f27"
      },
      {
         "mediaType": "application/vnd.docker.image.rootfs.diff.tar.gzip",
         "size": 99,
         "digest": "sha256:782d2f0df1b37094da78776a309bad2e7eef366d5d9b8c08b40daf5dbd7f236f"
      },
      {
         "mediaType": "application/vnd.docker.image.rootfs.diff.tar.gzip",
         "size": 412,
         "digest": "sha256:b0648f46f4c9ee1f6a17e7b78cd9b265d9eeb6f6fb12cd24d8ed89e66b569b31"
      }
   ]
},"media_type_id":3,"configuration_media_type_id":8,"configuration_payload":{"architecture":"amd64","config":{"Hostname":"","Domainname":"","User":"","AttachStdin":false,"AttachStdout":false,"AttachStderr":false,"ExposedPorts":{"6379/tcp":{}},"Tty":false,"OpenStdin":false,"StdinOnce":false,"Env":["PATH=/usr/local/sbin:/usr/local/bin:/usr/sbin:/usr/bin:/sbin:/bin","REDIS_VERSION=5.0.8","REDIS_DOWNLOAD_URL=http://download.redis.io/releases/redis-5.0.8.tar.gz","REDIS_DOWNLOAD_SHA=f3c7eac42f433326a8d981b50dba0169fdfaf46abb23fcda2f933a7552ee4ed7"],"Cmd":["redis-server"],"ArgsEscaped":true,"Image":"sha256:48b62076f0b0623482dce9b4414571bc4443aa3a83e4ea820c21eb6c14887c4f","Volumes":{"/data":{}},"WorkingDir":"/data","Entrypoint":["docker-entrypoint.sh"],"OnBuild":null,"Labels":null},"container":"8754014bbafd6868baaf2fb67f9fdbbb0eab785ddf4c85f6d4cfe22cacf395f9","container_config":{"Hostname":"8754014bbafd","Domainname":"","User":"","AttachStdin":false,"AttachStdout":false,"AttachStderr":false,"ExposedPorts":{"6379/tcp":{}},"Tty":false,"OpenStdin":false,"StdinOnce":false,"Env":["PATH=/usr/local/sbin:/usr/local/bin:/usr/sbin:/usr/bin:/sbin:/bin","REDIS_VERSION=5.0.8","REDIS_DOWNLOAD_URL=http://download.redis.io/releases/redis-5.0.8.tar.gz","REDIS_DOWNLOAD_SHA=f3c7eac42f433326a8d981b50dba0169fdfaf46abb23fcda2f933a7552ee4ed7"],"Cmd":["/bin/sh","-c","#(nop) ","CMD [\"redis-server\"]"],"ArgsEscaped":true,"Image":"sha256:48b62076f0b0623482dce9b4414571bc4443aa3a83e4ea820c21eb6c14887c4f","Volumes":{"/data":{}},"WorkingDir":"/data","Entrypoint":["docker-entrypoint.sh"],"OnBuild":null,"Labels":{}},"created":"2020-03-24T00:52:41.475490177Z","docker_version":"18.09.7","history":[{"created":"2020-03-23T21:19:34.027725872Z","created_by":"/bin/sh -c #(nop) ADD file:0c4555f363c2672e350001f1293e689875a3760afe7b3f9146886afe67121cba in / "},{"created":"2020-03-23T21:19:34.196162891Z","created_by":"/bin/sh -c #(nop)  CMD [\"/bin/sh\"]","empty_layer":true},{"created":"2020-03-24T00:49:58.642637457Z","created_by":"/bin/sh -c addgroup -S -g 1000 redis \u0026\u0026 adduser -S -G redis -u 999 redis"},{"created":"2020-03-24T00:49:59.878878083Z","created_by":"/bin/sh -c apk add --no-cache \t\t'su-exec\u003e=0.2' \t\ttzdata"},{"created":"2020-03-24T00:51:34.522903193Z","created_by":"/bin/sh -c #(nop)  ENV REDIS_VERSION=5.0.8","empty_layer":true},{"created":"2020-03-24T00:51:34.722732808Z","created_by":"/bin/sh -c #(nop)  ENV REDIS_DOWNLOAD_URL=http://download.redis.io/releases/redis-5.0.8.tar.gz","empty_layer":true},{"created":"2020-03-24T00:51:34.895137205Z","created_by":"/bin/sh -c #(nop)  ENV REDIS_DOWNLOAD_SHA=f3c7eac42f433326a8d981b50dba0169fdfaf46abb23fcda2f933a7552ee4ed7","empty_layer":true},{"created":"2020-03-24T00:52:39.466203175Z","created_by":"/bin/sh -c set -eux; \t\tapk add --no-cache --virtual .build-deps \t\tcoreutils \t\tgcc \t\tlinux-headers \t\tmake \t\tmusl-dev \t\topenssl-dev \t; \t\twget -O redis.tar.gz \"$REDIS_DOWNLOAD_URL\"; \techo \"$REDIS_DOWNLOAD_SHA *redis.tar.gz\" | sha256sum -c -; \tmkdir -p /usr/src/redis; \ttar -xzf redis.tar.gz -C /usr/src/redis --strip-components=1; \trm redis.tar.gz; \t\tgrep -q '^#define CONFIG_DEFAULT_PROTECTED_MODE 1$' /usr/src/redis/src/server.h; \tsed -ri 's!^(#define CONFIG_DEFAULT_PROTECTED_MODE) 1$!\\1 0!' /usr/src/redis/src/server.h; \tgrep -q '^#define CONFIG_DEFAULT_PROTECTED_MODE 0$' /usr/src/redis/src/server.h; \t\tmake -C /usr/src/redis -j \"$(nproc)\" all; \tmake -C /usr/src/redis install; \t\tserverMd5=\"$(md5sum /usr/local/bin/redis-server | cut -d' ' -f1)\"; export serverMd5; \tfind /usr/local/bin/redis* -maxdepth 0 \t\t-type f -not -name redis-server \t\t-exec sh -eux -c ' \t\t\tmd5=\"$(md5sum \"$1\" | cut -d\" \" -f1)\"; \t\t\ttest \"$md5\" = \"$serverMd5\"; \t\t' -- '{}' ';' \t\t-exec ln -svfT 'redis-server' '{}' ';' \t; \t\trm -r /usr/src/redis; \t\trunDeps=\"$( \t\tscanelf --needed --nobanner --format '%n#p' --recursive /usr/local \t\t\t| tr ',' '\\n' \t\t\t| sort -u \t\t\t| awk 'system(\"[ -e /usr/local/lib/\" $1 \" ]\") == 0 { next } { print \"so:\" $1 }' \t)\"; \tapk add --no-network --virtual .redis-rundeps $runDeps; \tapk del --no-network .build-deps; \t\tredis-cli --version; \tredis-server --version"},{"created":"2020-03-24T00:52:40.272049424Z","created_by":"/bin/sh -c mkdir /data \u0026\u0026 chown redis:redis /data"},{"created":"2020-03-24T00:52:40.475101518Z","created_by":"/bin/sh -c #(nop)  VOLUME [/data]","empty_layer":true},{"created":"2020-03-24T00:52:40.679688345Z","created_by":"/bin/sh -c #(nop) WORKDIR /data","empty_layer":true},{"created":"2020-03-24T00:52:40.903593606Z","created_by":"/bin/sh -c #(nop) COPY file:c48b97ea65422782310396358f838c38c0747767dd606a88d4c3d0b034a60762 in /usr/local/bin/ "},{"created":"2020-03-24T00:52:41.071499209Z","created_by":"/bin/sh -c #(nop)  ENTRYPOINT [\"docker-entrypoint.sh\"]","empty_layer":true},{"created":"2020-03-24T00:52:41.287703391Z","created_by":"/bin/sh -c #(nop)  EXPOSE 6379","empty_layer":true},{"created":"2020-03-24T00:52:41.475490177Z","created_by":"/bin/sh -c #(nop)  CMD [\"redis-server\"]","empty_layer":true}],"os":"linux","rootfs":{"type":"layers","diff_ids":["sha256:beee9f30bc1f711043e78d4a2be0668955d4b761d587d6f60c2c8dc081efb203","sha256:bc5a81440134d738e909891494d42f7262a4e4cf8cc73293c28a654d3ba146cc","sha256:5212569ac346b490d48eb23f5511cf0f0303728d21f2d60677f8bd5a84a11460","sha256:942e9c5e3ec035e2073be487c1d33d7887a403b8e97bf7a005397e8e73cb5d57","sha256:4961798cca421ac19f8ee435ee17047a9a76d2ce613d0eb58fa138aef0a10f3c","sha256:fab4f1d112f4fa06e2dcb24f691c2af76892909f78ea785aff83b0f41904ae31"]}},"configuration_blob_digest":"015c5637d8a82384db15453cd807664167553ad6dd5c261438a0e93e279b2dbb68"}, 
 {"id":3,"repository_id":4,"created_at":"2020-04-15T12:04:28.95584","schema_version":2,"digest":"0118e31fe73a142c094fedbcdac27973233f82e5c9ef7b10386991deffd47caded","payload":{
   "schemaVersion": 2,
   "mediaType": "application/vnd.docker.distribution.manifest.v2+json",
   "config": {
      "mediaType": "application/vnd.docker.container.image.v1+json",
      "size": 5532,
      "digest": "sha256:c59f425529b7d5d3fb646a0a5288878d27a16fee361d86ab89d3be36c1e6e560"
   },
   "layers": [
      {
         "mediaType": "application/vnd.docker.image.rootfs.diff.tar.gzip",
         "size": 2803255,
         "digest": "sha256:aad63a9339440e7c3e1fff2b988991b9bfb81280042fa7f39a5e327023056819"
      },
      {
         "mediaType": "application/vnd.docker.image.rootfs.diff.tar.gzip",
         "size": 1228,
         "digest": "sha256:541cb024bf66c36eab08a7896d96ba1e929b45e33b9242d912e4c982a8e6d2c8"
      },
      {
         "mediaType": "application/vnd.docker.image.rootfs.diff.tar.gzip",
         "size": 402572,
         "digest": "sha256:270420c343f3239793a3aa2928f17b524d4061b0d21d3f634b9ccaca25eba02d"
      },
      {
         "mediaType": "application/vnd.docker.image.rootfs.diff.tar.gzip",
         "size": 4501173,
         "digest": "sha256:eb793112d4077f146a27ba841424de424e659fa019b2528709d10fe58d2b7218"
      },
      {
         "mediaType": "application/vnd.docker.image.rootfs.diff.tar.gzip",
         "size": 99,
         "digest": "sha256:d800150424402c2d3c7002f4291741de85dfb4cacc7ac87dda88a7af750e198c"
      },
      {
         "mediaType": "application/vnd.docker.image.rootfs.diff.tar.gzip",
         "size": 414,
         "digest": "sha256:de8942d49ac9c76729cb5eacea126b7ade803035bfff2e026bb63683f53e353c"
      }
   ]
},"media_type_id":3,"configuration_media_type_id":8,"configuration_payload":{"architecture":"amd64","config":{"Hostname":"","Domainname":"","User":"","AttachStdin":false,"AttachStdout":false,"AttachStderr":false,"ExposedPorts":{"6379/tcp":{}},"Tty":false,"OpenStdin":false,"StdinOnce":false,"Env":["PATH=/usr/local/sbin:/usr/local/bin:/usr/sbin:/usr/bin:/sbin:/bin","REDIS_VERSION=4.0.14","REDIS_DOWNLOAD_URL=http://download.redis.io/releases/redis-4.0.14.tar.gz","REDIS_DOWNLOAD_SHA=1e1e18420a86cfb285933123b04a82e1ebda20bfb0a289472745a087587e93a7"],"Cmd":["redis-server"],"ArgsEscaped":true,"Image":"sha256:65e0eab145ea3df4a4cc9bc2f08c0ede791bc1d65b210a5359618007b0b6d8e9","Volumes":{"/data":{}},"WorkingDir":"/data","Entrypoint":["docker-entrypoint.sh"],"OnBuild":null,"Labels":null},"container":"81f11db016a0dd3ec947c5fa8f8f4c52a72f9e582e8364f6c4ead301ba94dd60","container_config":{"Hostname":"81f11db016a0","Domainname":"","User":"","AttachStdin":false,"AttachStdout":false,"AttachStderr":false,"ExposedPorts":{"6379/tcp":{}},"Tty":false,"OpenStdin":false,"StdinOnce":false,"Env":["PATH=/usr/local/sbin:/usr/local/bin:/usr/sbin:/usr/bin:/sbin:/bin","REDIS_VERSION=4.0.14","REDIS_DOWNLOAD_URL=http://download.redis.io/releases/redis-4.0.14.tar.gz","REDIS_DOWNLOAD_SHA=1e1e18420a86cfb285933123b04a82e1ebda20bfb0a289472745a087587e93a7"],"Cmd":["/bin/sh","-c","#(nop) ","CMD [\"redis-server\"]"],"ArgsEscaped":true,"Image":"sha256:65e0eab145ea3df4a4cc9bc2f08c0ede791bc1d65b210a5359618007b0b6d8e9","Volumes":{"/data":{}},"WorkingDir":"/data","Entrypoint":["docker-entrypoint.sh"],"OnBuild":null,"Labels":{}},"created":"2020-03-24T00:53:36.48646124Z","docker_version":"18.09.7","history":[{"created":"2020-03-23T21:19:34.027725872Z","created_by":"/bin/sh -c #(nop) ADD file:0c4555f363c2672e350001f1293e689875a3760afe7b3f9146886afe67121cba in / "},{"created":"2020-03-23T21:19:34.196162891Z","created_by":"/bin/sh -c #(nop)  CMD [\"/bin/sh\"]","empty_layer":true},{"created":"2020-03-24T00:49:58.642637457Z","created_by":"/bin/sh -c addgroup -S -g 1000 redis \u0026\u0026 adduser -S -G redis -u 999 redis"},{"created":"2020-03-24T00:49:59.878878083Z","created_by":"/bin/sh -c apk add --no-cache \t\t'su-exec\u003e=0.2' \t\ttzdata"},{"created":"2020-03-24T00:53:01.203081664Z","created_by":"/bin/sh -c #(nop)  ENV REDIS_VERSION=4.0.14","empty_layer":true},{"created":"2020-03-24T00:53:01.409019557Z","created_by":"/bin/sh -c #(nop)  ENV REDIS_DOWNLOAD_URL=http://download.redis.io/releases/redis-4.0.14.tar.gz","empty_layer":true},{"created":"2020-03-24T00:53:01.598823196Z","created_by":"/bin/sh -c #(nop)  ENV REDIS_DOWNLOAD_SHA=1e1e18420a86cfb285933123b04a82e1ebda20bfb0a289472745a087587e93a7","empty_layer":true},{"created":"2020-03-24T00:53:34.412554596Z","created_by":"/bin/sh -c set -eux; \t\tapk add --no-cache --virtual .build-deps \t\tcoreutils \t\tgcc \t\tlinux-headers \t\tmake \t\tmusl-dev \t\topenssl-dev \t; \t\twget -O redis.tar.gz \"$REDIS_DOWNLOAD_URL\"; \techo \"$REDIS_DOWNLOAD_SHA *redis.tar.gz\" | sha256sum -c -; \tmkdir -p /usr/src/redis; \ttar -xzf redis.tar.gz -C /usr/src/redis --strip-components=1; \trm redis.tar.gz; \t\tgrep -q '^#define CONFIG_DEFAULT_PROTECTED_MODE 1$' /usr/src/redis/src/server.h; \tsed -ri 's!^(#define CONFIG_DEFAULT_PROTECTED_MODE) 1$!\\1 0!' /usr/src/redis/src/server.h; \tgrep -q '^#define CONFIG_DEFAULT_PROTECTED_MODE 0$' /usr/src/redis/src/server.h; \t\tmake -C /usr/src/redis -j \"$(nproc)\" all; \tmake -C /usr/src/redis install; \t\tserverMd5=\"$(md5sum /usr/local/bin/redis-server | cut -d' ' -f1)\"; export serverMd5; \tfind /usr/local/bin/redis* -maxdepth 0 \t\t-type f -not -name redis-server \t\t-exec sh -eux -c ' \t\t\tmd5=\"$(md5sum \"$1\" | cut -d\" \" -f1)\"; \t\t\ttest \"$md5\" = \"$serverMd5\"; \t\t' -- '{}' ';' \t\t-exec ln -svfT 'redis-server' '{}' ';' \t; \t\trm -r /usr/src/redis; \t\trunDeps=\"$( \t\tscanelf --needed --nobanner --format '%n#p' --recursive /usr/local \t\t\t| tr ',' '\\n' \t\t\t| sort -u \t\t\t| awk 'system(\"[ -e /usr/local/lib/\" $1 \" ]\") == 0 { next } { print \"so:\" $1 }' \t)\"; \tapk add --no-network --virtual .redis-rundeps $runDeps; \tapk del --no-network .build-deps; \t\tredis-cli --version; \tredis-server --version"},{"created":"2020-03-24T00:53:35.219227357Z","created_by":"/bin/sh -c mkdir /data \u0026\u0026 chown redis:redis /data"},{"created":"2020-03-24T00:53:35.427328104Z","created_by":"/bin/sh -c #(nop)  VOLUME [/data]","empty_layer":true},{"created":"2020-03-24T00:53:35.651172162Z","created_by":"/bin/sh -c #(nop) WORKDIR /data","empty_layer":true},{"created":"2020-03-24T00:53:35.927395676Z","created_by":"/bin/sh -c #(nop) COPY file:c48b97ea65422782310396358f838c38c0747767dd606a88d4c3d0b034a60762 in /usr/local/bin/ "},{"created":"2020-03-24T00:53:36.114454222Z","created_by":"/bin/sh -c #(nop)  ENTRYPOINT [\"docker-entrypoint.sh\"]","empty_layer":true},{"created":"2020-03-24T00:53:36.298359539Z","created_by":"/bin/sh -c #(nop)  EXPOSE 6379","empty_layer":true},{"created":"2020-03-24T00:53:36.48646124Z","created_by":"/bin/sh -c #(nop)  CMD [\"redis-server\"]","empty_layer":true}],"os":"linux","rootfs":{"type":"layers","diff_ids":["sha256:beee9f30bc1f711043e78d4a2be0668955d4b761d587d6f60c2c8dc081efb203","sha256:bc5a81440134d738e909891494d42f7262a4e4cf8cc73293c28a654d3ba146cc","sha256:5212569ac346b490d48eb23f5511cf0f0303728d21f2d60677f8bd5a84a11460","sha256:692bf7906cbbb647e7381216bb5e1d708ca2a05998cbfccca6def4c3f6a9fccd","sha256:068ccc121d6dd4c0bb03dcd3b3793b39b2fa63ffcf606540f14f01856d345417","sha256:baf6c482be2e888923e7201e56ed111c019f47e84a05ed08824b7d8d03338038"]}},"configuration_blob_digest":"01c59f425529b7d5d3fb646a0a5288878d27a16fee361d86ab89d3be36c1e6e560"}, 
 {"id":4,"repository_id":4,"created_at":"2020-04-15T12:04:28.95584","schema_version":2,"digest":"018205a681aa6eea2b0c27249894def02a14ff2cbe9fc78e83d62ad04d1180deb9","payload":{
   "schemaVersion": 2,
   "mediaType": "application/vnd.docker.distribution.manifest.v2+json",
   "config": {
      "mediaType": "application/vnd.docker.container.image.v1+json",
      "size": 5101,
      "digest": "sha256:631bf69df08e11fff62ae65c901ba312618056a197b8e44a8c8b5a14e19599f2"
   },
   "layers": [
      {
         "mediaType": "application/vnd.docker.image.rootfs.diff.tar.gzip",
         "size": 2757034,
         "digest": "sha256:e7c96db7181be991f19a9fb6975cdbbd73c65f4a2681348e63a141a2192a5f10"
      },
      {
         "mediaType": "application/vnd.docker.image.rootfs.diff.tar.gzip",
         "size": 1253,
         "digest": "sha256:b8af38234db8796d645ec9541647315cdae2830b8f7c477b618feabbeee672cc"
      },
      {
         "mediaType": "application/vnd.docker.image.rootfs.diff.tar.gzip",
         "size": 403836,
         "digest": "sha256:c7b5e96879e00e980373ed29b9088020ea3d931c156252c1aae326b86a6775d4"
      },
      {
         "mediaType": "application/vnd.docker.image.rootfs.diff.tar.gzip",
         "size": 14604899,
         "digest": "sha256:bd01e7204bc2e6511d76700eae62c49824b429140735ce33c26ec5cf7cd2fd08"
      },
      {
         "mediaType": "application/vnd.docker.image.rootfs.diff.tar.gzip",
         "size": 98,
         "digest": "sha256:3250e649335b95bc1de7ab27c52ca193d65d443aebb81d0b41a93c3cebcd8fe1"
      },
      {
         "mediaType": "application/vnd.docker.image.rootfs.diff.tar.gzip",
         "size": 413,
         "digest": "sha256:df4e8d78e015de17d85dccd54bb6fcae57e89d1840062fc71b8f6cf97d34be64"
      }
   ]
},"media_type_id":3,"configuration_media_type_id":8,"configuration_payload":{"architecture":"amd64","config":{"Hostname":"","Domainname":"","User":"","AttachStdin":false,"AttachStdout":false,"AttachStderr":false,"ExposedPorts":{"6379/tcp":{}},"Tty":false,"OpenStdin":false,"StdinOnce":false,"Env":["PATH=/usr/local/sbin:/usr/local/bin:/usr/sbin:/usr/bin:/sbin:/bin","REDIS_VERSION=5.0.4","REDIS_DOWNLOAD_URL=http://download.redis.io/releases/redis-5.0.4.tar.gz","REDIS_DOWNLOAD_SHA=3ce9ceff5a23f60913e1573f6dfcd4aa53b42d4a2789e28fa53ec2bd28c987dd"],"Cmd":["redis-server"],"ArgsEscaped":true,"Image":"sha256:afd44981e4a33a0068bd0260a0b8660b176745913522faca906da83f8d076361","Volumes":{"/data":{}},"WorkingDir":"/data","Entrypoint":["docker-entrypoint.sh"],"OnBuild":null,"Labels":null},"container":"d13ca3f830f16e37485b0199dfeaf12a856c55348c0242b5ab40068b1fc21b5b","container_config":{"Hostname":"d13ca3f830f1","Domainname":"","User":"","AttachStdin":false,"AttachStdout":false,"AttachStderr":false,"ExposedPorts":{"6379/tcp":{}},"Tty":false,"OpenStdin":false,"StdinOnce":false,"Env":["PATH=/usr/local/sbin:/usr/local/bin:/usr/sbin:/usr/bin:/sbin:/bin","REDIS_VERSION=5.0.4","REDIS_DOWNLOAD_URL=http://download.redis.io/releases/redis-5.0.4.tar.gz","REDIS_DOWNLOAD_SHA=3ce9ceff5a23f60913e1573f6dfcd4aa53b42d4a2789e28fa53ec2bd28c987dd"],"Cmd":["/bin/sh","-c","#(nop) ","CMD [\"redis-server\"]"],"ArgsEscaped":true,"Image":"sha256:afd44981e4a33a0068bd0260a0b8660b176745913522faca906da83f8d076361","Volumes":{"/data":{}},"WorkingDir":"/data","Entrypoint":["docker-entrypoint.sh"],"OnBuild":null,"Labels":{}},"created":"2019-05-11T01:45:46.435430289Z","docker_version":"18.06.1-ce","history":[{"created":"2019-05-11T00:07:03.358250803Z","created_by":"/bin/sh -c #(nop) ADD file:a86aea1f3a7d68f6ae03397b99ea77f2e9ee901c5c59e59f76f93adbb4035913 in / "},{"created":"2019-05-11T00:07:03.510395965Z","created_by":"/bin/sh -c #(nop)  CMD [\"/bin/sh\"]","empty_layer":true},{"created":"2019-05-11T01:43:50.557549768Z","created_by":"/bin/sh -c addgroup -S redis \u0026\u0026 adduser -S -G redis redis"},{"created":"2019-05-11T01:43:52.363434171Z","created_by":"/bin/sh -c apk add --no-cache \t\t'su-exec\u003e=0.2' \t\ttzdata"},{"created":"2019-05-11T01:43:52.634259015Z","created_by":"/bin/sh -c #(nop)  ENV REDIS_VERSION=5.0.4","empty_layer":true},{"created":"2019-05-11T01:43:52.892396849Z","created_by":"/bin/sh -c #(nop)  ENV REDIS_DOWNLOAD_URL=http://download.redis.io/releases/redis-5.0.4.tar.gz","empty_layer":true},{"created":"2019-05-11T01:43:53.141670384Z","created_by":"/bin/sh -c #(nop)  ENV REDIS_DOWNLOAD_SHA=3ce9ceff5a23f60913e1573f6dfcd4aa53b42d4a2789e28fa53ec2bd28c987dd","empty_layer":true},{"created":"2019-05-11T01:45:43.65725451Z","created_by":"/bin/sh -c set -ex; \t\tapk add --no-cache --virtual .build-deps \t\tcoreutils \t\tgcc \t\tlinux-headers \t\tmake \t\tmusl-dev \t; \t\twget -O redis.tar.gz \"$REDIS_DOWNLOAD_URL\"; \techo \"$REDIS_DOWNLOAD_SHA *redis.tar.gz\" | sha256sum -c -; \tmkdir -p /usr/src/redis; \ttar -xzf redis.tar.gz -C /usr/src/redis --strip-components=1; \trm redis.tar.gz; \t\tgrep -q '^#define CONFIG_DEFAULT_PROTECTED_MODE 1$' /usr/src/redis/src/server.h; \tsed -ri 's!^(#define CONFIG_DEFAULT_PROTECTED_MODE) 1$!\\1 0!' /usr/src/redis/src/server.h; \tgrep -q '^#define CONFIG_DEFAULT_PROTECTED_MODE 0$' /usr/src/redis/src/server.h; \t\tmake -C /usr/src/redis -j \"$(nproc)\"; \tmake -C /usr/src/redis install; \t\trm -r /usr/src/redis; \t\trunDeps=\"$( \t\tscanelf --needed --nobanner --format '%n#p' --recursive /usr/local \t\t\t| tr ',' '\\n' \t\t\t| sort -u \t\t\t| awk 'system(\"[ -e /usr/local/lib/\" $1 \" ]\") == 0 { next } { print \"so:\" $1 }' \t)\"; \tapk add --virtual .redis-rundeps $runDeps; \tapk del .build-deps; \t\tredis-server --version"},{"created":"2019-05-11T01:45:44.828575719Z","created_by":"/bin/sh -c mkdir /data \u0026\u0026 chown redis:redis /data"},{"created":"2019-05-11T01:45:45.088129767Z","created_by":"/bin/sh -c #(nop)  VOLUME [/data]","empty_layer":true},{"created":"2019-05-11T01:45:45.378882889Z","created_by":"/bin/sh -c #(nop) WORKDIR /data","empty_layer":true},{"created":"2019-05-11T01:45:45.680073648Z","created_by":"/bin/sh -c #(nop) COPY file:c48b97ea65422782310396358f838c38c0747767dd606a88d4c3d0b034a60762 in /usr/local/bin/ "},{"created":"2019-05-11T01:45:45.935940011Z","created_by":"/bin/sh -c #(nop)  ENTRYPOINT [\"docker-entrypoint.sh\"]","empty_layer":true},{"created":"2019-05-11T01:45:46.199969099Z","created_by":"/bin/sh -c #(nop)  EXPOSE 6379","empty_layer":true},{"created":"2019-05-11T01:45:46.435430289Z","created_by":"/bin/sh -c #(nop)  CMD [\"redis-server\"]","empty_layer":true}],"os":"linux","rootfs":{"type":"layers","diff_ids":["sha256:f1b5933fe4b5f49bbe8258745cf396afe07e625bdab3168e364daf7c956b6b81","sha256:90e3352930da8147d972640e45c377d5e58d081045cb0530de0659147f737f3a","sha256:7e18d8bb6e4f591d542308c3842225e983c274dcf613ad48486a51318a654b93","sha256:e486a972764a47e432dc271c24ff602b0b10c1ab4a5ca855b9f242d5dd0372e5","sha256:100fb4a660e12f057f29d11878fb3301f15a0d72eec236286e4a8ac5eeba371b","sha256:88eee37ac3ee0aa58d71db7c4722bf22700afe163e52fe83ae86f74a5e8de425"]}},"configuration_blob_digest":"01631bf69df08e11fff62ae65c901ba312618056a197b8e44a8c8b5a14e19599f2"}, 
 {"id":5,"repository_id":7,"created_at":"2020-04-15T12:04:28.95584","schema_version":2,"digest":"01d2e931823751ff06f08f70b7603a20b9e8af7b0d9afcb493d934327d622d2a1e","payload":{
   "schemaVersion": 2,
   "mediaType": "application/vnd.docker.distribution.manifest.v2+json",
   "config": {
      "mediaType": "application/vnd.docker.container.image.v1+json",
      "size": 5108,
      "digest": "sha256:ca0b6709748d024a67c502558ea88dc8a1f8a858d380f5ddafa1504126a3b018"
   },
   "layers": [
      {
         "mediaType": "application/vnd.docker.image.rootfs.diff.tar.gzip",
         "size": 2065537,
         "digest": "sha256:ff3a5c916c92643ff77519ffa742d3ec61b7f591b6b7504599d95a4a41134e28"
      },
      {
         "mediaType": "application/vnd.docker.image.rootfs.diff.tar.gzip",
         "size": 1252,
         "digest": "sha256:aae70a2e60279ffae89150a59b81fe10d1d81f341ef6f31b9714ea6cc3418577"
      },
      {
         "mediaType": "application/vnd.docker.image.rootfs.diff.tar.gzip",
         "size": 8554,
         "digest": "sha256:87c655da471c9a7d8f946ec7b04a6a72a98ae8c1734bddf4b950861b5638fe20"
      },
      {
         "mediaType": "application/vnd.docker.image.rootfs.diff.tar.gzip",
         "size": 5887815,
         "digest": "sha256:bc3141806bdc4b83ac744c622a094557530eb0806035fd282d94a12c445403c5"
      },
      {
         "mediaType": "application/vnd.docker.image.rootfs.diff.tar.gzip",
         "size": 98,
         "digest": "sha256:53616fb426d99f5067684c6302e7f05774538757388a5425bfad9b261e106f08"
      },
      {
         "mediaType": "application/vnd.docker.image.rootfs.diff.tar.gzip",
         "size": 397,
         "digest": "sha256:9791c5883c6a7a073f047dabfb3ed6b47e24ac016d7f51bbe16f06acafaeb6ee"
      }
   ]
},"media_type_id":3,"configuration_media_type_id":8,"configuration_payload":{"architecture":"amd64","config":{"Hostname":"","Domainname":"","User":"","AttachStdin":false,"AttachStdout":false,"AttachStderr":false,"ExposedPorts":{"6379/tcp":{}},"Tty":false,"OpenStdin":false,"StdinOnce":false,"Env":["PATH=/usr/local/sbin:/usr/local/bin:/usr/sbin:/usr/bin:/sbin:/bin","REDIS_VERSION=3.2.11","REDIS_DOWNLOAD_URL=http://download.redis.io/releases/redis-3.2.11.tar.gz","REDIS_DOWNLOAD_SHA=31ae927cab09f90c9ca5954aab7aeecc3bb4da6087d3d12ba0a929ceb54081b5"],"Cmd":["redis-server"],"ArgsEscaped":true,"Image":"sha256:69868e872ba136071f7f89a106ba83e4ae742a3244af26bec521bfa2facea0a6","Volumes":{"/data":{}},"WorkingDir":"/data","Entrypoint":["docker-entrypoint.sh"],"OnBuild":[],"Labels":null},"container":"9e1b6083cde627172a467907882ad67de452b08b0701076681a899dd0b4e4d55","container_config":{"Hostname":"9e1b6083cde6","Domainname":"","User":"","AttachStdin":false,"AttachStdout":false,"AttachStderr":false,"ExposedPorts":{"6379/tcp":{}},"Tty":false,"OpenStdin":false,"StdinOnce":false,"Env":["PATH=/usr/local/sbin:/usr/local/bin:/usr/sbin:/usr/bin:/sbin:/bin","REDIS_VERSION=3.2.11","REDIS_DOWNLOAD_URL=http://download.redis.io/releases/redis-3.2.11.tar.gz","REDIS_DOWNLOAD_SHA=31ae927cab09f90c9ca5954aab7aeecc3bb4da6087d3d12ba0a929ceb54081b5"],"Cmd":["/bin/sh","-c","#(nop) ","CMD [\"redis-server\"]"],"ArgsEscaped":true,"Image":"sha256:69868e872ba136071f7f89a106ba83e4ae742a3244af26bec521bfa2facea0a6","Volumes":{"/data":{}},"WorkingDir":"/data","Entrypoint":["docker-entrypoint.sh"],"OnBuild":[],"Labels":{}},"created":"2018-05-21T21:30:18.104069469Z","docker_version":"17.06.2-ce","history":[{"created":"2018-01-09T21:10:58.365737589Z","created_by":"/bin/sh -c #(nop) ADD file:093f0723fa46f6cdbd6f7bd146448bb70ecce54254c35701feeceb956414622f in / "},{"created":"2018-01-09T21:10:58.579708634Z","created_by":"/bin/sh -c #(nop)  CMD [\"/bin/sh\"]","empty_layer":true},{"created":"2018-01-24T00:17:37.903111265Z","created_by":"/bin/sh -c addgroup -S redis \u0026\u0026 adduser -S -G redis redis"},{"created":"2018-01-24T00:17:41.612579248Z","created_by":"/bin/sh -c apk add --no-cache 'su-exec\u003e=0.2'"},{"created":"2018-01-24T00:17:41.97397235Z","created_by":"/bin/sh -c #(nop)  ENV REDIS_VERSION=3.2.11","empty_layer":true},{"created":"2018-01-24T00:17:42.356241455Z","created_by":"/bin/sh -c #(nop)  ENV REDIS_DOWNLOAD_URL=http://download.redis.io/releases/redis-3.2.11.tar.gz","empty_layer":true},{"created":"2018-01-24T00:17:42.73271852Z","created_by":"/bin/sh -c #(nop)  ENV REDIS_DOWNLOAD_SHA=31ae927cab09f90c9ca5954aab7aeecc3bb4da6087d3d12ba0a929ceb54081b5","empty_layer":true},{"created":"2018-05-21T21:30:15.913873377Z","created_by":"/bin/sh -c set -ex; \t\tapk add --no-cache --virtual .build-deps \t\tcoreutils \t\tgcc \t\tjemalloc-dev \t\tlinux-headers \t\tmake \t\tmusl-dev \t; \t\twget -O redis.tar.gz \"$REDIS_DOWNLOAD_URL\"; \techo \"$REDIS_DOWNLOAD_SHA *redis.tar.gz\" | sha256sum -c -; \tmkdir -p /usr/src/redis; \ttar -xzf redis.tar.gz -C /usr/src/redis --strip-components=1; \trm redis.tar.gz; \t\tgrep -q '^#define CONFIG_DEFAULT_PROTECTED_MODE 1$' /usr/src/redis/src/server.h; \tsed -ri 's!^(#define CONFIG_DEFAULT_PROTECTED_MODE) 1$!\\1 0!' /usr/src/redis/src/server.h; \tgrep -q '^#define CONFIG_DEFAULT_PROTECTED_MODE 0$' /usr/src/redis/src/server.h; \t\tmake -C /usr/src/redis -j \"$(nproc)\"; \tmake -C /usr/src/redis install; \t\trm -r /usr/src/redis; \t\trunDeps=\"$( \t\tscanelf --needed --nobanner --format '%n#p' --recursive /usr/local \t\t\t| tr ',' '\\n' \t\t\t| sort -u \t\t\t| awk 'system(\"[ -e /usr/local/lib/\" $1 \" ]\") == 0 { next } { print \"so:\" $1 }' \t)\"; \tapk add --virtual .redis-rundeps $runDeps; \tapk del .build-deps; \t\tredis-server --version"},{"created":"2018-05-21T21:30:16.591737355Z","created_by":"/bin/sh -c mkdir /data \u0026\u0026 chown redis:redis /data"},{"created":"2018-05-21T21:30:16.817652051Z","created_by":"/bin/sh -c #(nop)  VOLUME [/data]","empty_layer":true},{"created":"2018-05-21T21:30:17.096241959Z","created_by":"/bin/sh -c #(nop) WORKDIR /data","empty_layer":true},{"created":"2018-05-21T21:30:17.425331146Z","created_by":"/bin/sh -c #(nop) COPY file:9b596974f478088dc2d2bf2906046f6c8872ecff3c716abd89850fd50ec90c47 in /usr/local/bin/ "},{"created":"2018-05-21T21:30:17.641811717Z","created_by":"/bin/sh -c #(nop)  ENTRYPOINT [\"docker-entrypoint.sh\"]","empty_layer":true},{"created":"2018-05-21T21:30:17.865752306Z","created_by":"/bin/sh -c #(nop)  EXPOSE 6379/tcp","empty_layer":true},{"created":"2018-05-21T21:30:18.104069469Z","created_by":"/bin/sh -c #(nop)  CMD [\"redis-server\"]","empty_layer":true}],"os":"linux","rootfs":{"type":"layers","diff_ids":["sha256:cd7100a72410606589a54b932cabd804a17f9ae5b42a1882bd56d263e02b6215","sha256:ad9247fe8c639c4b643c3c9ba1cf48f0f0ecbbe9ebdff61134ce4278a3cfec77","sha256:c3d2785637343250f39cc5f824bf7d03d8a586ae701b0d9ec9ea7dfce3d059b3","sha256:e3b89804d966d76c2c4f28ec83439cfc0172a5a4b39c7e97c9f3204ea39aaa5b","sha256:938588d29d17f373ecab9ea9e110b99783bae458e13833d5416f9f45be483340","sha256:a521e34fcf3d296742422b730056665464dca384f377b68218a56657f0180a33"]}},"configuration_blob_digest":"01ca0b6709748d024a67c502558ea88dc8a1f8a858d380f5ddafa1504126a3b018"}, 
 {"id":6,"repository_id":8,"created_at":"2020-04-15T12:04:28.95584","schema_version":2,"digest":"01f8f5ca4728269ef4eecd49db2345a03f8ab9244e049fc2af96f7b422dd6df009","payload":{
   "schemaVersion": 2,
   "mediaType": "application/vnd.docker.distribution.manifest.list.v2+json",
   "manifests": [
      {
         "mediaType": "application/vnd.docker.distribution.manifest.v2+json",
         "size": 528,
         "digest": "sha256:cb8a924afdf0229ef7515d9e5b3024e23b3eb03ddbba287f4a19c6ac90b8d221",
         "platform": {
            "architecture": "amd64",
            "os": "linux"
         }
      },
      {
         "mediaType": "application/vnd.docker.distribution.manifest.v2+json",
         "size": 528,
         "digest": "sha256:597bd5c319cc09d6bb295b4ef23cac50ec7c373fff5fe923cfd246ec09967b31",
         "platform": {
            "architecture": "arm64",
            "os": "linux"
         }
      }
   ]
},"media_type_id":4,"configuration_media_type_id":null,"configuration_payload":null,"configuration_blob_digest":null}, 
 {"id":7,"repository_id":8,"created_at":"2020-04-15T12:04:28.95584","schema_version":2,"digest":"01cb8a924afdf0229ef7515d9e5b3024e23b3eb03ddbba287f4a19c6ac90b8d221","payload":{
   "schemaVersion": 2,
   "mediaType": "application/vnd.docker.distribution.manifest.v2+json",
   "config": {
      "mediaType": "application/vnd.docker.container.image.v1+json",
      "size": 1509,
      "digest": "sha256:a187dde48cd289ac374ad8539930628314bc581a481cdb41409c9289419ddb72"
   },
   "layers": [
      {
         "mediaType": "application/vnd.docker.image.rootfs.diff.tar.gzip",
         "size": 2803255,
         "digest": "sha256:aad63a9339440e7c3e1fff2b988991b9bfb81280042fa7f39a5e327023056819"
      }
   ]
},"media_type_id":3,"configuration_media_type_id":8,"configuration_payload":{"architecture":"amd64","config":{"Hostname":"","Domainname":"","User":"","AttachStdin":false,"AttachStdout":false,"AttachStderr":false,"Tty":false,"OpenStdin":false,"StdinOnce":false,"Env":["PATH=/usr/local/sbin:/usr/local/bin:/usr/sbin:/usr/bin:/sbin:/bin"],"Cmd":["/bin/sh"],"ArgsEscaped":true,"Image":"sha256:74df73bb19fbfc7fb5ab9a8234b3d98ee2fb92df5b824496679802685205ab8c","Volumes":null,"WorkingDir":"","Entrypoint":null,"OnBuild":null,"Labels":null},"container":"fb71ddde5f6411a82eb056a9190f0cc1c80d7f77a8509ee90a2054428edb0024","container_config":{"Hostname":"fb71ddde5f64","Domainname":"","User":"","AttachStdin":false,"AttachStdout":false,"AttachStderr":false,"Tty":false,"OpenStdin":false,"StdinOnce":false,"Env":["PATH=/usr/local/sbin:/usr/local/bin:/usr/sbin:/usr/bin:/sbin:/bin"],"Cmd":["/bin/sh","-c","#(nop) ","CMD [\"/bin/sh\"]"],"ArgsEscaped":true,"Image":"sha256:74df73bb19fbfc7fb5ab9a8234b3d98ee2fb92df5b824496679802685205ab8c","Volumes":null,"WorkingDir":"","Entrypoint":null,"OnBuild":null,"Labels":{}},"created":"2020-03-23T21:19:34.196162891Z","docker_version":"18.09.7","history":[{"created":"2020-03-23T21:19:34.027725872Z","created_by":"/bin/sh -c #(nop) ADD file:0c4555f363c2672e350001f1293e689875a3760afe7b3f9146886afe67121cba in / "},{"created":"2020-03-23T21:19:34.196162891Z","created_by":"/bin/sh -c #(nop)  CMD [\"/bin/sh\"]","empty_layer":true}],"os":"linux","rootfs":{"type":"layers","diff_ids":["sha256:beee9f30bc1f711043e78d4a2be0668955d4b761d587d6f60c2c8dc081efb203"]}},"configuration_blob_digest":"01a187dde48cd289ac374ad8539930628314bc581a481cdb41409c9289419ddb72"}, 
 {"id":8,"repository_id":8,"created_at":"2020-04-15T12:04:28.95584","schema_version":2,"digest":"01597bd5c319cc09d6bb295b4ef23cac50ec7c373fff5fe923cfd246ec09967b31","payload":{
   "schemaVersion": 2,
   "mediaType": "application/vnd.docker.distribution.manifest.v2+json",
   "config": {
      "mediaType": "application/vnd.docker.container.image.v1+json",
      "size": 1509,
      "digest": "sha256:2ee122dcc32de080998a9e1ab8665445f621cd323d3ce6bdea2b8a58a921f312"
   },
   "layers": [
      {
         "mediaType": "application/vnd.docker.image.rootfs.diff.tar.gzip",
         "size": 2723139,
         "digest": "sha256:8a0637ca1ac98db4cf29f7632449c92801adc80cf0da2cd9c9e39882ce466561"
      }
   ]
},"media_type_id":3,"configuration_media_type_id":8,"configuration_payload":{"architecture":"arm64","config":{"Hostname":"","Domainname":"","User":"","AttachStdin":false,"AttachStdout":false,"AttachStderr":false,"Tty":false,"OpenStdin":false,"StdinOnce":false,"Env":["PATH=/usr/local/sbin:/usr/local/bin:/usr/sbin:/usr/bin:/sbin:/bin"],"Cmd":["/bin/sh"],"ArgsEscaped":true,"Image":"sha256:3b4c9bf302e38ec6706ebb5bcfd942afbba488ad0ad27583f0146018638e949e","Volumes":null,"WorkingDir":"","Entrypoint":null,"OnBuild":null,"Labels":null},"container":"93fce45805a181158be8fa78c882f776bbab3ca574861b7e38fed81eb0709c3b","container_config":{"Hostname":"93fce45805a1","Domainname":"","User":"","AttachStdin":false,"AttachStdout":false,"AttachStderr":false,"Tty":false,"OpenStdin":false,"StdinOnce":false,"Env":["PATH=/usr/local/sbin:/usr/local/bin:/usr/sbin:/usr/bin:/sbin:/bin"],"Cmd":["/bin/sh","-c","#(nop) ","CMD [\"/bin/sh\"]"],"ArgsEscaped":true,"Image":"sha256:3b4c9bf302e38ec6706ebb5bcfd942afbba488ad0ad27583f0146018638e949e","Volumes":null,"WorkingDir":"","Entrypoint":null,"OnBuild":null,"Labels":{}},"created":"2020-03-23T21:39:53.041338799Z","docker_version":"18.09.7","history":[{"created":"2020-03-23T21:39:52.296870342Z","created_by":"/bin/sh -c #(nop) ADD file:746a5c3838a898d6acf7877552ff13d1ab40d0036ace7a662e7c747018315ddb in / "},{"created":"2020-03-23T21:39:53.041338799Z","created_by":"/bin/sh -c #(nop)  CMD [\"/bin/sh\"]","empty_layer":true}],"os":"linux","rootfs":{"type":"layers","diff_ids":["sha256:294ac687b5fcac6acedb9a20cc756ffe39ebc87e8a0214d3fb8ef3fc3189ee2a"]}},"configuration_blob_digest":"012ee122dcc32de080998a9e1ab8665445f621cd323d3ce6bdea2b8a58a921f312"}, 
 {"id":9,"repository_id":10,"created_at":"2020-04-15T12:04:28.95584","schema_version":2,"digest":"01cc2f7914532f430d4e5d75b5c855ec4b46feb893bbd2974456f0bf46015b7621","payload":{"schemaVersion":2,"config":{"mediaType":"application/vnd.cncf.helm.config.v1+json","digest":"sha256:cbcce8ad7fdaea54f60aeef01f57f2f46f67382b5d391d63d2b55f536195935a","size":139},"layers":[{"mediaType":"application/tar+gzip","digest":"sha256:50723273cfd47a0e6222d64e993b1bd1bb97f84b4e0d1336bc0e24596c72b631","size":1371}]},"media_type_id":17,"configuration_media_type_id":19,"configuration_payload":{"name":"e-helm","version":"latest","description":"Sample Helm Chart","apiVersion":"v2","appVersion":"1.16.0","type":"application"},"configuration_blob_digest":"01cbcce8ad7fdaea54f60aeef01f57f2f46f67382b5d391d63d2b55f536195935a"}, 
 {"id":10,"repository_id":11,"created_at":"2020-04-15T12:04:28.95584","schema_version":2,"digest":"01efdb07f074a5cfb25547c0cf1ddac509a10ec9eb15e565584988c913ccaa344a","payload":{
   "schemaVersion": 2,
   "mediaType": "application/vnd.docker.distribution.manifest.v2+json",
   "config": {
      "mediaType": "application/vnd.docker.container.image.v1+json",
      "size": 2048,
      "digest": "sha256:bda9e8f07268fe2c2e97833c721102739f7d6ff9401b7f03aaec176e772bbd8b"
   },
   "layers": [
      {
         "mediaType": "application/vnd.docker.image.rootfs.diff.tar.gzip",
         "size": 2802957,
         "digest": "sha256:c9b1b535fdd91a9855fb7f82348177e5f019329a58c53c47272962dd60f71fc9"
      },
      {
         "mediaType": "application/vnd.docker.image.rootfs.diff.tar.gzip",
         "size": 149,
         "digest": "sha256:5042ef227578477784ce48d26f549739d919223ca9a511efb2be091cd6e7c957"
      },
      {
         "mediaType": "application/vnd.docker.image.rootfs.diff.tar.gzip",
         "size": 524674,
         "digest": "sha256:ba44d9d3f13a26d49ec4e53f8b69092d61c7f7fd9d4abd07ae086d96958fdb13"
      },
      {
         "mediaType": "application/vnd.docker.image.rootfs.diff.tar.gzip",
         "size": 164,
         "digest": "sha256:04f2d9b76105721fac9b03445f164e585457002aa69a36f84bda78e848e48ebe"
      }
   ]
},"media_type_id":3,"configuration_media_type_id":8,"configuration_payload":{"architecture":"amd64","config":{"Hostname":"","Domainname":"","User":"","AttachStdin":false,"AttachStdout":false,"AttachStderr":false,"Tty":false,"OpenStdin":false,"StdinOnce":false,"Env":["PATH=/usr/local/sbin:/usr/local/bin:/usr/sbin:/usr/bin:/sbin:/bin"],"Cmd":["/bin/sh"],"ArgsEscaped":true,"Image":"sha256:9d6b6d46491e1405e1b7203140a29800e3b134db3cc539f29b7a4636dd1d8286","Volumes":null,"WorkingDir":"","Entrypoint":null,"OnBuild":null,"Labels":null},"container":"7399108be765ff6baec06f1645ec97e95dc99f9640e579b307da5148b877224f","container_config":{"Hostname":"","Domainname":"","User":"","AttachStdin":false,"AttachStdout":false,"AttachStderr":false,"Tty":false,"OpenStdin":false,"StdinOnce":false,"Env":["PATH=/usr/local/sbin:/usr/local/bin:/usr/sbin:/usr/bin:/sbin:/bin"],"Cmd":["/bin/sh","-c","date '+%s' \u003e /root/test/date.txt"],"Image":"sha256:9d6b6d46491e1405e1b7203140a29800e3b134db3cc539f29b7a4636dd1d8286","Volumes":null,"WorkingDir":"","Entrypoint":null,"OnBuild":null,"Labels":null},"created":"2020-08-24T23:01:30.585662893Z","docker_version":"19.03.12","history":[{"created":"2020-01-18T01:19:37.02673981Z","created_by":"/bin/sh -c #(nop) ADD file:e69d441d729412d24675dcd33e04580885df99981cec43de8c9b24015313ff8e in / "},{"created":"2020-01-18T01:19:37.187497623Z","created_by":"/bin/sh -c #(nop)  CMD [\"/bin/sh\"]","empty_layer":true},{"created":"2020-08-24T23:01:29.10717021Z","created_by":"/bin/sh -c mkdir -p /root/test/"},{"created":"2020-08-24T23:01:29.797630922Z","created_by":"/bin/sh -c head -c 524288 \u003c/dev/urandom \u003e /root/test/randfile.txt"},{"created":"2020-08-24T23:01:30.585662893Z","created_by":"/bin/sh -c date '+%s' \u003e /root/test/date.txt"}],"os":"linux","rootfs":{"type":"layers","diff_ids":["sha256:5216338b40a7b96416b8b9858974bbe4acc3096ee60acbc4dfb1ee02aecceb10","sha256:33a35dd1887305f24f8c37b10e568cd7761652bf9bc8e8915ae896f45bf472de","sha256:df1f7117a5b99687e61ac677473d91fa86ed401f83f9be6944d4464b9211b909","sha256:c8c7a284da6ac23da3d33edb505224646cbabb9bf7c2accaaca121e930ad581f"]}},"configuration_blob_digest":"01bda9e8f07268fe2c2e97833c721102739f7d6ff9401b7f03aaec176e772bbd8b"}]