[{"size":2048,"created_at":"2020-04-15T12:04:28.95584","media_type_id":8,"digest":"\\x01bda9e8f07268fe2c2e97833c721102739f7d6ff9401b7f03aaec176e772bbd8b"}, 
 {"size":2802957,"created_at":"2020-04-15T12:04:28.95584","media_type_id":6,"digest":"\\x01c9b1b535fdd91a9855fb7f82348177e5f019329a58c53c47272962dd60f71fc9"}, 
 {"size":149,"created_at":"2020-04-15T12:04:28.95584","media_type_id":6,"digest":"\\x015042ef227578477784ce48d26f549739d919223ca9a511efb2be091cd6e7c957"}, 
 {"size":524674,"created_at":"2020-04-15T12:04:28.95584","media_type_id":6,"digest":"\\x01ba44d9d3f13a26d49ec4e53f8b69092d61c7f7fd9d4abd07ae086d96958fdb13"}, 
 {"size":164,"created_at":"2020-04-15T12:04:28.95584","media_type_id":6,"digest":"\\x0104f2d9b76105721fac9b03445f164e585457002aa69a36f84bda78e848e48ebe"}, 
 {"size":1152,"created_at":"2020-04-15T12:04:28.95584","media_type_id":21,"digest":"\\x010797a0a40af972bf80b598f093b124f0186918e77adba9bbdbddb9dbacc52583"}, 
 {"size":1152,"created_at":"2020-04-15T12:04:28.95584","media_type_id":21,"digest":"\\x01105cd60674ce6f073246fc08f34ebc523f90a47652e81a0b1244d3e63aacbfdf"}, 
 {"size":1570,"created_at":"2020-04-15T12:04:28.95584","media_type_id":21,"digest":"\\x0118e31fe73a142c094fedbcdac27973233f82e5c9ef7b10386991deffd47caded"}, 
 {"size":5,"created_at":"2020-04-15T12:04:28.95584","media_type_id":21,"digest":"\\x01270420c343f3239793a3aa2928f17b524d4061b0d21d3f634b9ccaca25eba02d"}, 
 {"size":1509,"created_at":"2020-04-15T12:04:28.95584","media_type_id":21,"digest":"\\x012ee122dcc32de080998a9e1ab8665445f621cd323d3ce6bdea2b8a58a921f312"}, 
 {"size":6,"created_at":"2020-04-15T12:04:28.95584","media_type_id":21,"digest":"\\x013250e649335b95bc1de7ab27c52ca193d65d443aebb81d0b41a93c3cebcd8fe1"}, 
 {"size":149,"created_at":"2020-04-15T12:04:28.95584","media_type_id":21,"digest":"\\x0138927b8c2bae0bb9f6782a3fd7a22496f7f6dd8612c8bb5f30ab8b42edb75e76"}, 
 {"size":2049,"created_at":"2020-04-15T12:04:28.95584","media_type_id":21,"digest":"\\x013ef776e71635d79e5b6b8b6317b3adeda3b0c8aca61c4537678cc02eab466b17"}, 
 {"size":8,"created_at":"2020-04-15T12:04:28.95584","media_type_id":21,"digest":"\\x0150723273cfd47a0e6222d64e993b1bd1bb97f84b4e0d1336bc0e24596c72b631"}, 
 {"size":7,"created_at":"2020-04-15T12:04:28.95584","media_type_id":21,"digest":"\\x0153616fb426d99f5067684c6302e7f05774538757388a5425bfad9b261e106f08"}, 
 {"size":5,"created_at":"2020-04-15T12:04:28.95584","media_type_id":21,"digest":"\\x01541cb024bf66c36eab08a7896d96ba1e929b45e33b9242d912e4c982a8e6d2c8"}, 
 {"size":528,"created_at":"2020-04-15T12:04:28.95584","media_type_id":21,"digest":"\\x01597bd5c319cc09d6bb295b4ef23cac50ec7c373fff5fe923cfd246ec09967b31"}, 
 {"size":5528,"created_at":"2020-04-15T12:04:28.95584","media_type_id":21,"digest":"\\x015c5637d8a82384db15453cd807664167553ad6dd5c261438a0e93e279b2dbb68"}, 
 {"size":5101,"created_at":"2020-04-15T12:04:28.95584","media_type_id":21,"digest":"\\x01631bf69df08e11fff62ae65c901ba312618056a197b8e44a8c8b5a14e19599f2"}, 
 {"size":149,"created_at":"2020-04-15T12:04:28.95584","media_type_id":21,"digest":"\\x01662e0fc8fe1dcc493dca9890e6f02c35f83d38fa9e762b38ffadb1189d35c494"}, 
 {"size":1152,"created_at":"2020-04-15T12:04:28.95584","media_type_id":21,"digest":"\\x01673315e9c0cad797587b6bc0c1e2b9a1903c15b521f26acc5364fcf034c0cfbd"}, 
 {"size":524671,"created_at":"2020-04-15T12:04:28.95584","media_type_id":21,"digest":"\\x0175543ad505259af72704dd911f8ec2cddc01ce9abc79345afbbdb1b7778a6310"}, 
 {"size":6,"created_at":"2020-04-15T12:04:28.95584","media_type_id":21,"digest":"\\x01782d2f0df1b37094da78776a309bad2e7eef366d5d9b8c08b40daf5dbd7f236f"}, 
 {"size":1152,"created_at":"2020-04-15T12:04:28.95584","media_type_id":21,"digest":"\\x017f5a9ac68ec48e38f5fb11177fc4558d60e406b772ffd7eef345911826e5ada2"}, 
 {"size":165,"created_at":"2020-04-15T12:04:28.95584","media_type_id":21,"digest":"\\x017fdaa424ac2a164c64948219cdc37d3975e4e4caf7b700092775fce0f1e1ac52"}, 
 {"size":1571,"created_at":"2020-04-15T12:04:28.95584","media_type_id":21,"digest":"\\x018205a681aa6eea2b0c27249894def02a14ff2cbe9fc78e83d62ad04d1180deb9"}, 
 {"size":6,"created_at":"2020-04-15T12:04:28.95584","media_type_id":21,"digest":"\\x0187c655da471c9a7d8f946ec7b04a6a72a98ae8c1734bddf4b950861b5638fe20"}, 
 {"size":6,"created_at":"2020-04-15T12:04:28.95584","media_type_id":21,"digest":"\\x018a0637ca1ac98db4cf29f7632449c92801adc80cf0da2cd9c9e39882ce466561"}, 
 {"size":6,"created_at":"2020-04-15T12:04:28.95584","media_type_id":21,"digest":"\\x018dd6c66eb1b07a8ca5d7a27c0e926ff8381c20cdf6dac0ac7fa2d76b836f2f27"}, 
 {"size":2126,"created_at":"2020-04-15T12:04:28.95584","media_type_id":21,"digest":"\\x018e1f28640eee7964ed4583b8f969a222c40bbd82afb930027d2f6adeba5a4e4b"}, 
 {"size":163,"created_at":"2020-04-15T12:04:28.95584","media_type_id":21,"digest":"\\x01924c56d4299dfd204bb44564604124e503d6a6f7c15cba4d444ad569012ffab9"}, 
 {"size":6,"created_at":"2020-04-15T12:04:28.95584","media_type_id":21,"digest":"\\x019791c5883c6a7a073f047dabfb3ed6b47e24ac016d7f51bbe16f06acafaeb6ee"}, 
 {"size":1509,"created_at":"2020-04-15T12:04:28.95584","media_type_id":21,"digest":"\\x01a187dde48cd289ac374ad8539930628314bc581a481cdb41409c9289419ddb72"}, 
 {"size":527,"created_at":"2020-04-15T12:04:28.95584","media_type_id":21,"digest":"\\x01a2490cec4484ee6c1068ba3a05f89934010c85242f736280b35343483b2264b6"}, 
 {"size":524679,"created_at":"2020-04-15T12:04:28.95584","media_type_id":21,"digest":"\\x01a2fb90fbbeba5363762b4daf4a4d9a925e5a18a58f8cb1571d2e33c2ffc6b437"}, 
 {"size":6,"created_at":"2020-04-15T12:04:28.95584","media_type_id":21,"digest":"\\x01a3ed95caeb02ffe68cdd9fd84406680ae93d633cb16422d00e8a7c22955b46d4"}, 
 {"size":149,"created_at":"2020-04-15T12:04:28.95584","media_type_id":21,"digest":"\\x01a50d1d359d8caefdca616daf1cd30f9e07c7bcfbfcdc37ced801ba341ab8e9e5"}, 
 {"size":1152,"created_at":"2020-04-15T12:04:28.95584","media_type_id":21,"digest":"\\x01a848997f1caa7406fa148e184820f1ff55076eb3e5b33a8c09d1bb34cf335e7e"}, 
 {"size":6,"created_at":"2020-04-15T12:04:28.95584","media_type_id":21,"digest":"\\x01aad63a9339440e7c3e1fff2b988991b9bfb81280042fa7f39a5e327023056819"}, 
 {"size":6,"created_at":"2020-04-15T12:04:28.95584","media_type_id":21,"digest":"\\x01aae70a2e60279ffae89150a59b81fe10d1d81f341ef6f31b9714ea6cc3418577"}, 
 {"size":5,"created_at":"2020-04-15T12:04:28.95584","media_type_id":21,"digest":"\\x01b0648f46f4c9ee1f6a17e7b78cd9b265d9eeb6f6fb12cd24d8ed89e66b569b31"}, 
 {"size":2049,"created_at":"2020-04-15T12:04:28.95584","media_type_id":21,"digest":"\\x01b265c63feef2db2365adab2b8f9cfdc4f8fef20f623a2c171bc3ef4d61779c91"}, 
 {"size":2049,"created_at":"2020-04-15T12:04:28.95584","media_type_id":21,"digest":"\\x01b2bcfe10fa6003f524448b2c3eb2d72cc4d7a6160eae1b243e7cae47e73bd8b5"}, 
 {"size":7,"created_at":"2020-04-15T12:04:28.95584","media_type_id":21,"digest":"\\x01b8af38234db8796d645ec9541647315cdae2830b8f7c477b618feabbeee672cc"}, 
 {"size":6,"created_at":"2020-04-15T12:04:28.95584","media_type_id":21,"digest":"\\x01bc3141806bdc4b83ac744c622a094557530eb0806035fd282d94a12c445403c5"}, 
 {"size":6,"created_at":"2020-04-15T12:04:28.95584","media_type_id":21,"digest":"\\x01bd01e7204bc2e6511d76700eae62c49824b429140735ce33c26ec5cf7cd2fd08"}, 
 {"size":1494,"created_at":"2020-04-15T12:04:28.95584","media_type_id":21,"digest":"\\x01be5888e67be651f1fbb59006f0fd791b44ed3fceaa6323ab4e37d5928874345a"}, 
 {"size":5532,"created_at":"2020-04-15T12:04:28.95584","media_type_id":21,"digest":"\\x01c59f425529b7d5d3fb646a0a5288878d27a16fee361d86ab89d3be36c1e6e560"}, 
 {"size":6,"created_at":"2020-04-15T12:04:28.95584","media_type_id":21,"digest":"\\x01c7b5e96879e00e980373ed29b9088020ea3d931c156252c1aae326b86a6775d4"}, 
 {"size":5108,"created_at":"2020-04-15T12:04:28.95584","media_type_id":21,"digest":"\\x01ca0b6709748d024a67c502558ea88dc8a1f8a858d380f5ddafa1504126a3b018"}, 
 {"size":528,"created_at":"2020-04-15T12:04:28.95584","media_type_id":21,"digest":"\\x01cb8a924afdf0229ef7515d9e5b3024e23b3eb03ddbba287f4a19c6ac90b8d221"}, 
 {"size":131,"created_at":"2020-04-15T12:04:28.95584","media_type_id":21,"digest":"\\x01cbcce8ad7fdaea54f60aeef01f57f2f46f67382b5d391d63d2b55f536195935a"}, 
 {"size":322,"created_at":"2020-04-15T12:04:28.95584","media_type_id":21,"digest":"\\x01cc2f7914532f430d4e5d75b5c855ec4b46feb893bbd2974456f0bf46015b7621"}, 
 {"size":1570,"created_at":"2020-04-15T12:04:28.95584","media_type_id":21,"digest":"\\x01cda5d02e4ea900a8d52e834bc3158e83b8a87a5b44ae081885aecf9b156dcff1"}, 
 {"size":1568,"created_at":"2020-04-15T12:04:28.95584","media_type_id":21,"digest":"\\x01d2e931823751ff06f08f70b7603a20b9e8af7b0d9afcb493d934327d622d2a1e"}, 
 {"size":7,"created_at":"2020-04-15T12:04:28.95584","media_type_id":21,"digest":"\\x01d800150424402c2d3c7002f4291741de85dfb4cacc7ac87dda88a7af750e198c"}, 
 {"size":6,"created_at":"2020-04-15T12:04:28.95584","media_type_id":21,"digest":"\\x01de8942d49ac9c76729cb5eacea126b7ade803035bfff2e026bb63683f53e353c"}, 
 {"size":6,"created_at":"2020-04-15T12:04:28.95584","media_type_id":21,"digest":"\\x01df4e8d78e015de17d85dccd54bb6fcae57e89d1840062fc71b8f6cf97d34be64"}, 
 {"size":6,"created_at":"2020-04-15T12:04:28.95584","media_type_id":21,"digest":"\\x01e2334dd9fee4b77e48a8f2d793904118a3acf26f1f2e72a3d79c6cae993e07f0"}, 
 {"size":164,"created_at":"2020-04-15T12:04:28.95584","media_type_id":21,"digest":"\\x01e2d30fbdb0781e04de442a7c3eca67d997e5c87da3bd4286c274cc6c4ec707c7"}, 
 {"size":6,"created_at":"2020-04-15T12:04:28.95584","media_type_id":21,"digest":"\\x01e7c96db7181be991f19a9fb6975cdbbd73c65f4a2681348e63a141a2192a5f10"}, 
 {"size":6,"created_at":"2020-04-15T12:04:28.95584","media_type_id":21,"digest":"\\x01eb793112d4077f146a27ba841424de424e659fa019b2528709d10fe58d2b7218"}, 
 {"size":1152,"created_at":"2020-04-15T12:04:28.95584","media_type_id":21,"digest":"\\x01efdb07f074a5cfb25547c0cf1ddac509a10ec9eb15e565584988c913ccaa344a"}, 
 {"size":741,"created_at":"2020-04-15T12:04:28.95584","media_type_id":21,"digest":"\\x01f8f5ca4728269ef4eecd49db2345a03f8ab9244e049fc2af96f7b422dd6df009"}, 
 {"size":6,"created_at":"2020-04-15T12:04:28.95584","media_type_id":21,"digest":"\\x01ff3a5c916c92643ff77519ffa742d3ec61b7f591b6b7504599d95a4a41134e28"}]