{
  "project_info": {
    "project_number": "946442803958",
    "firebase_url": "https://restaurantapp-fa519.firebaseio.com",
    "project_id": "restaurantapp-fa519",
    "storage_bucket": "restaurantapp-fa519.appspot.com"
  },
  "client": [
    {
      "client_info": {
        "mobilesdk_app_id": "1:946442803958:android:8a80dfea166ad597",
        "android_client_info": {
          "package_name": "com.example.sharp.restauranteat"
        }
      },
      "oauth_client": [
        {
          "client_id": "946442803958-ar95a9guk9mvi6gi4u773kkf4gltr61b.apps.googleusercontent.com",
          "client_type": 1,
          "android_info": {
            "package_name": "com.example.sharp.restauranteat",
            "certificate_hash": "b8e20e89d897510b85a61492014b30633fe6d210"
          }
        },
        {
          "client_id": "946442803958-1vljrmmrtc0prahe2qhiornat55vhsd1.apps.googleusercontent.com",
          "client_type": 3
        }
      ],
      "api_key": [
        {
          "current_key": "AIzaSyCR4imIQZS6UMbQTUrhG1_q6ISCL0HyIZk"
        }
      ],
      "services": {
        "analytics_service": {
          "status": 1
        },
        "appinvite_service": {
          "status": 2,
          "other_platform_oauth_client": [
            {
              "client_id": "946442803958-1vljrmmrtc0prahe2qhiornat55vhsd1.apps.googleusercontent.com",
              "client_type": 3
            }
          ]
        },
        "ads_service": {
          "status": 2
        }
      }
    }
  ],
  "configuration_version": "1"
}