{
    "status" : 200,
    "message" : "Success",
    "data" : {
        "kelas" : {
            "id" : "B84UGJN485",
            "users" : [
                1930629106962395,2155845121099654,1501333276614180,1459501404105189
            ]
        }
    }
}
