<svg width="15" height="19" viewBox="0 0 15 19" fill="none" xmlns="http://www.w3.org/2000/svg">
<path d="M10.4518 3.91089C10.4518 4.38782 10.3377 4.83809 10.1354 5.23593C11.357 5.30842 13.0531 5.42611 13.6392 5.53794C14.3481 5.67323 14.8186 6.23805 14.8845 6.9568C14.9185 7.32646 14.9528 7.80432 14.9814 8.41416C15.0031 8.87713 14.3983 9.17664 13.9545 9.04294C13.7059 8.96802 13.4423 8.92776 13.1693 8.92776C11.6685 8.92776 10.4518 10.1444 10.4518 11.6452C10.4518 13.1461 11.6685 14.3627 13.1693 14.3627C13.4475 14.3627 13.716 14.3209 13.9688 14.2432C14.4115 14.1071 15.0173 14.4029 14.9996 14.8658C14.9682 15.6854 14.926 16.2995 14.8845 16.7517C14.8186 17.4705 14.3481 18.0353 13.6392 18.1706C12.7013 18.3496 10.226 18.5434 7.52531 18.5434C4.82465 18.5434 2.34932 18.3496 1.41144 18.1706C0.702488 18.0353 0.232047 17.4705 0.166084 16.7517C0.084246 15.86 0 14.3388 0 11.8543C0 9.36979 0.084246 7.84851 0.166084 6.9568C0.232047 6.23805 0.702488 5.67323 1.41144 5.53794C1.99751 5.42611 3.69359 5.30842 4.91524 5.23593C4.71289 4.83809 4.5988 4.38782 4.5988 3.91089C4.5988 2.29462 5.90904 0.984375 7.52531 0.984375C9.14158 0.984375 10.4518 2.29462 10.4518 3.91089Z" fill="#5600A8"/>
<path d="M10.4518 3.91089C10.4518 4.38782 10.3377 4.83809 10.1354 5.23593C11.357 5.30842 13.0531 5.42611 13.6392 5.53794C14.3481 5.67323 14.8186 6.23805 14.8845 6.9568C14.9185 7.32646 14.9528 7.80432 14.9814 8.41416C15.0031 8.87713 14.3983 9.17664 13.9545 9.04294C13.7059 8.96802 13.4423 8.92776 13.1693 8.92776C11.6685 8.92776 10.4518 10.1444 10.4518 11.6452C10.4518 13.1461 11.6685 14.3627 13.1693 14.3627C13.4475 14.3627 13.716 14.3209 13.9688 14.2432C14.4115 14.1071 15.0173 14.4029 14.9996 14.8658C14.9682 15.6854 14.926 16.2995 14.8845 16.7517C14.8186 17.4705 14.3481 18.0353 13.6392 18.1706C12.7013 18.3496 10.226 18.5434 7.52531 18.5434C4.82465 18.5434 2.34932 18.3496 1.41144 18.1706C0.702488 18.0353 0.232047 17.4705 0.166084 16.7517C0.084246 15.86 0 14.3388 0 11.8543C0 9.36979 0.084246 7.84851 0.166084 6.9568C0.232047 6.23805 0.702488 5.67323 1.41144 5.53794C1.99751 5.42611 3.69359 5.30842 4.91524 5.23593C4.71289 4.83809 4.5988 4.38782 4.5988 3.91089C4.5988 2.29462 5.90904 0.984375 7.52531 0.984375C9.14158 0.984375 10.4518 2.29462 10.4518 3.91089Z" stroke="black"/>
</svg>
