{
  "/users/getAll": "UsersController:getAll",
  "/users/getAllBy": "UsersController:getAllBy",
  "/user/getbyid/(:)" : "UsersController:getById",

  "/registration/user/form" : "UsersController:showForm",
  "/create/user": "UsersController:createUserAction",
  "/confirmDelete/user/(:)":"UsersController:deleteUserForm",
  "/delete/user/(:)": "UsersController:deleteUserAction",
  "/connexion/user/form": "UsersController:showForm",
  "/connexion/user": "UsersController:connexionUserAction",


  "/":                                "DefaultController:redirectAccueil",
  "/message":                         "DefaultController:showForm",
  "/accueil":                         "DefaultController:showForm",
  "/accueil/membre":                  "DefaultController:showForm",
  "/geolocalisation":                 "DefaultController:showForm",
  "/registration/user/form":          "DefaultController:showForm",
  "/presentation":                    "DefaultController:showForm",



  "/create/email/admin":              "DefaultController:showForm",
  "/edit/trip/form":                  "DefaultController:showForm",
  "/show/list/trips":                 "DefaultController:showForm",
  "/connexion/user/form":             "DefaultController:showForm",
  "/show/trips":                      "DefaultController:showForm",
  "/dashboard/user/(:)":              "DefaultController:showForm",
  "/create/evaluation/form":          "DefaultController:showForm",
  "/messagerie/user/(:)":             "DefaultController:showForm",
  "/messagerie/email/user/(:)/form":  "DefaultController:showForm",
  "/alerts/user/(:)":                 "DefaultController:showForm",
  "/update/profil/user/(:)/form":     "DefaultController:showForm",
  "/profil/user/verifications":       "DefaultController:showForm",
  "/show/evaluation/given":           "DefaultController:showForm",
  "/show/evaluation/received":        "DefaultController:showForm",
  "/calcul/trip/form":                "DefaultController:showForm",
  "/edit/trip/(:)/form":              "DefaultController:showForm",
  "/show/evenement/(:)/form":         "DefaultController:showForm",
  "/show/user/profil":                "DefaultController:showForm",


  "/manage/registration/form":        "DefaultController:showForm"

}
