module udemy/certificate

go 1.18

require (
	github.com/boombuler/barcode v1.0.0 // indirect
	github.com/jung-kurt/gofpdf v1.16.2 // indirect
	github.com/phpdave11/gofpdi v1.0.7 // indirect
	github.com/pkg/errors v0.8.1 // indirect
	github.com/ruudk/golang-pdf417 v0.0.0-20181029194003-1af4ab5afa58 // indirect
	golang.org/x/image v0.0.0-20190910094157-69e4b8554b2a // indirect
)
