## Interface: 90001
## Title: |cff16C3F2AddOn|r|cFFFFFFFFSkins|r
## Version: 4.45
## Author: Azilroka, NihilisticPandemonium
## SavedVariables: AddOnSkinsDB, AddOnSkinsDS
## OptionalDeps: ElvUI

Load_AddOnSkins.xml
