#1:iter	2:compliance	3:duration	4:volume	5:lambda	6:lambda_iters	7:lower	8:upper
0 	15.3731 	0.291 	0.651438 	0 	0 	0 	0
1 	15.8456 	0.01 	0.632035 	99218.8 	7 	99218.8 	100000
2 	16.7802 	0.007 	0.605433 	198438 	7 	198438 	200000
3 	19.697 	0.008 	0.553953 	198438 	7 	198438 	200000
4 	22.1014 	0.012 	0.500001 	118.34 	26 	118.34 	118.343
5 	21.2546 	0.009 	0.499999 	78.3899 	13 	78.3682 	78.3899
6 	20.6231 	0.009 	0.500001 	69.3142 	16 	69.3142 	69.316
7 	20.1334 	0.01 	0.5 	60.8958 	16 	60.8958 	60.8974
8 	19.7645 	0.011 	0.5 	53.0943 	13 	53.0831 	53.0943
9 	19.5309 	0.011 	0.499999 	45.811 	14 	45.8061 	45.811
10 	19.3757 	0.01 	0.5 	41.5337 	15 	41.5316 	41.5337
