[Info]
Version 1
Dimension 2
NumNodes 35
Num3DElements 0
Num2DElements 24
Num1DElements 0
NumNodeBC 28
NumSaveNodes 0
NumSaveElements 0
Num 2d-line      : 0
Num 2d-line,quad : 0
Num 3d-line      : 0
Num 3d-line,quad : 0
Num triangle     : 0
Num triangle,quad: 0
Num quadr        : 24
Num quadr,quad   : 0
Num tetra        : 0
Num tetra,quad   : 0
Num brick        : 0
Num brick,quad   : 0
Num pyramid      : 0
Num pyramid,quad : 0
Num wedge        : 0
Num wedge,quad   : 0

[Nodes]
#NodeNr x-coord y-coord z-coord
1  0.0  0.0  0.0
2  0.5  0.0  0.0
3  1.0  0.0  0.0
4  1.5  0.0  0.0
5  2.0  0.0  0.0
6  2.5  0.0  0.0
7  3.0  0.0  0.0
8  0.0  0.5  0.0
9  0.5  0.5  0.0
10  1.0  0.5  0.0
11  1.5  0.5  0.0
12  2.0  0.5  0.0
13  2.5  0.5  0.0
14  3.0  0.5  0.0
15  0.0  1.0  0.0
16  0.5  1.0  0.0
17  1.0  1.0  0.0
18  1.5  1.0  0.0
19  2.0  1.0  0.0
20  2.5  1.0  0.0
21  3.0  1.0  0.0
22  0.0  1.5  0.0
23  0.5  1.5  0.0
24  1.0  1.5  0.0
25  1.5  1.5  0.0
26  2.0  1.5  0.0
27  2.5  1.5  0.0
28  3.0  1.5  0.0
29  0.0  2.0  0.0
30  0.5  2.0  0.0
31  1.0  2.0  0.0
32  1.5  2.0  0.0
33  2.0  2.0  0.0
34  2.5  2.0  0.0
35  3.0  2.0  0.0

[1D Elements]
#ElemNr  ElemType  NrOfNodes  Level
#Node1 Node2 ... NodeNrOfNodes

[2D Elements]
#ElemNr  ElemType  NrOfNodes  Level
#Node1 Node2 ... NodeNrOfNodes
1 6 4 mech
1 2 9 8
2 6 4 mech
2 3 10 9
3 6 4 mech
3 4 11 10
4 6 4 mech
4 5 12 11
5 6 4 mech
5 6 13 12
6 6 4 mech
6 7 14 13
7 6 4 mech
8 9 16 15
8 6 4 mech
9 10 17 16
9 6 4 mech
10 11 18 17
10 6 4 mech
11 12 19 18
11 6 4 mech
12 13 20 19
12 6 4 mech
13 14 21 20
13 6 4 mech
15 16 23 22
14 6 4 mech
16 17 24 23
15 6 4 mech
17 18 25 24
16 6 4 mech
18 19 26 25
17 6 4 mech
19 20 27 26
18 6 4 mech
20 21 28 27
19 6 4 mech
22 23 30 29
20 6 4 mech
23 24 31 30
21 6 4 mech
24 25 32 31
22 6 4 mech
25 26 33 32
23 6 4 mech
26 27 34 33
24 6 4 mech
27 28 35 34

[3D Elements]
#ElemNr  ElemType  NrOfNodes  Level
#Node1 Node2 ... NodeNrOfNodes

[Node BC]
#NodeNr Level
1 south
2 south
3 south
4 south
5 south
6 south
7 south
29 north
30 north
31 north
32 north
33 north
34 north
35 north
1 west
8 west
15 west
22 west
29 west
7 east
14 east
21 east
28 east
35 east
1 south_west
7 south_east
29 north_west
35 north_east

[Save Nodes]
#NodeNr Level

[Save Elements]
#ElemNr Level

 
