[Info]
Version 1
Dimension 2
NumNodes 256
Num3DElements 0
Num2DElements 225
Num1DElements 0
NumNodeBC 152
NumSaveNodes 0
NumSaveElements 0
Num 2d-line      : 0
Num 2d-line,quad : 0
Num 3d-line      : 0
Num 3d-line,quad : 0
Num triangle     : 0
Num triangle,quad: 0
Num quadr        : 225
Num quadr,quad   : 0
Num tetra        : 0
Num tetra,quad   : 0
Num brick        : 0
Num brick,quad   : 0
Num pyramid      : 0
Num pyramid,quad : 0
Num wedge        : 0
Num wedge,quad   : 0

[Nodes]
#NodeNr x-coord y-coord z-coord
1  0.0  0.0  0.0
2  0.0  0.066666666666667  0.0
3  0.0  0.133333333333333  0.0
4  0.0  0.2  0.0
5  0.0  0.266666666666667  0.0
6  0.0  0.333333333333333  0.0
7  0.0  0.4  0.0
8  0.0  0.466666666666667  0.0
9  0.0  0.533333333333333  0.0
10  0.0  0.6  0.0
11  0.0  0.666666666666667  0.0
12  0.0  0.733333333333333  0.0
13  0.0  0.8  0.0
14  0.0  0.866666666666667  0.0
15  0.0  0.933333333333333  0.0
16  0.0  1.0  0.0
17  0.066666666666667  0.0  0.0
18  0.066666666666667  0.066666666666667  0.0
19  0.066666666666667  0.133333333333333  0.0
20  0.066666666666667  0.2  0.0
21  0.066666666666667  0.266666666666667  0.0
22  0.066666666666667  0.333333333333333  0.0
23  0.066666666666667  0.4  0.0
24  0.066666666666667  0.466666666666667  0.0
25  0.066666666666667  0.533333333333333  0.0
26  0.066666666666667  0.6  0.0
27  0.066666666666667  0.666666666666667  0.0
28  0.066666666666667  0.733333333333333  0.0
29  0.066666666666667  0.8  0.0
30  0.066666666666667  0.866666666666667  0.0
31  0.066666666666667  0.933333333333333  0.0
32  0.066666666666667  1.0  0.0
33  0.133333333333333  0.0  0.0
34  0.133333333333333  0.066666666666667  0.0
35  0.133333333333333  0.133333333333333  0.0
36  0.133333333333333  0.2  0.0
37  0.133333333333333  0.266666666666667  0.0
38  0.133333333333333  0.333333333333333  0.0
39  0.133333333333333  0.4  0.0
40  0.133333333333333  0.466666666666667  0.0
41  0.133333333333333  0.533333333333333  0.0
42  0.133333333333333  0.6  0.0
43  0.133333333333333  0.666666666666667  0.0
44  0.133333333333333  0.733333333333333  0.0
45  0.133333333333333  0.8  0.0
46  0.133333333333333  0.866666666666667  0.0
47  0.133333333333333  0.933333333333333  0.0
48  0.133333333333333  1.0  0.0
49  0.2  0.0  0.0
50  0.2  0.066666666666667  0.0
51  0.2  0.133333333333333  0.0
52  0.2  0.2  0.0
53  0.2  0.266666666666667  0.0
54  0.2  0.333333333333333  0.0
55  0.2  0.4  0.0
56  0.2  0.466666666666667  0.0
57  0.2  0.533333333333333  0.0
58  0.2  0.6  0.0
59  0.2  0.666666666666667  0.0
60  0.2  0.733333333333333  0.0
61  0.2  0.8  0.0
62  0.2  0.866666666666667  0.0
63  0.2  0.933333333333333  0.0
64  0.2  1.0  0.0
65  0.266666666666667  0.0  0.0
66  0.266666666666667  0.066666666666667  0.0
67  0.266666666666667  0.133333333333333  0.0
68  0.266666666666667  0.2  0.0
69  0.266666666666667  0.266666666666667  0.0
70  0.266666666666667  0.333333333333333  0.0
71  0.266666666666667  0.4  0.0
72  0.266666666666667  0.466666666666667  0.0
73  0.266666666666667  0.533333333333333  0.0
74  0.266666666666667  0.6  0.0
75  0.266666666666667  0.666666666666667  0.0
76  0.266666666666667  0.733333333333333  0.0
77  0.266666666666667  0.8  0.0
78  0.266666666666667  0.866666666666667  0.0
79  0.266666666666667  0.933333333333333  0.0
80  0.266666666666667  1.0  0.0
81  0.333333333333333  0.0  0.0
82  0.333333333333333  0.066666666666667  0.0
83  0.333333333333333  0.133333333333333  0.0
84  0.333333333333333  0.2  0.0
85  0.333333333333333  0.266666666666667  0.0
86  0.333333333333333  0.333333333333333  0.0
87  0.333333333333333  0.4  0.0
88  0.333333333333333  0.466666666666667  0.0
89  0.333333333333333  0.533333333333333  0.0
90  0.333333333333333  0.6  0.0
91  0.333333333333333  0.666666666666667  0.0
92  0.333333333333333  0.733333333333333  0.0
93  0.333333333333333  0.8  0.0
94  0.333333333333333  0.866666666666667  0.0
95  0.333333333333333  0.933333333333333  0.0
96  0.333333333333333  1.0  0.0
97  0.4  0.0  0.0
98  0.4  0.066666666666667  0.0
99  0.4  0.133333333333333  0.0
100  0.4  0.2  0.0
101  0.4  0.266666666666667  0.0
102  0.4  0.333333333333333  0.0
103  0.4  0.4  0.0
104  0.4  0.466666666666667  0.0
105  0.4  0.533333333333333  0.0
106  0.4  0.6  0.0
107  0.4  0.666666666666667  0.0
108  0.4  0.733333333333333  0.0
109  0.4  0.8  0.0
110  0.4  0.866666666666667  0.0
111  0.4  0.933333333333333  0.0
112  0.4  1.0  0.0
113  0.466666666666667  0.0  0.0
114  0.466666666666667  0.066666666666667  0.0
115  0.466666666666667  0.133333333333333  0.0
116  0.466666666666667  0.2  0.0
117  0.466666666666667  0.266666666666667  0.0
118  0.466666666666667  0.333333333333333  0.0
119  0.466666666666667  0.4  0.0
120  0.466666666666667  0.466666666666667  0.0
121  0.466666666666667  0.533333333333333  0.0
122  0.466666666666667  0.6  0.0
123  0.466666666666667  0.666666666666667  0.0
124  0.466666666666667  0.733333333333333  0.0
125  0.466666666666667  0.8  0.0
126  0.466666666666667  0.866666666666667  0.0
127  0.466666666666667  0.933333333333333  0.0
128  0.466666666666667  1.0  0.0
129  0.533333333333333  0.0  0.0
130  0.533333333333333  0.066666666666667  0.0
131  0.533333333333333  0.133333333333333  0.0
132  0.533333333333333  0.2  0.0
133  0.533333333333333  0.266666666666667  0.0
134  0.533333333333333  0.333333333333333  0.0
135  0.533333333333333  0.4  0.0
136  0.533333333333333  0.466666666666667  0.0
137  0.533333333333333  0.533333333333333  0.0
138  0.533333333333333  0.6  0.0
139  0.533333333333333  0.666666666666667  0.0
140  0.533333333333333  0.733333333333333  0.0
141  0.533333333333333  0.8  0.0
142  0.533333333333333  0.866666666666667  0.0
143  0.533333333333333  0.933333333333333  0.0
144  0.533333333333333  1.0  0.0
145  0.6  0.0  0.0
146  0.6  0.066666666666667  0.0
147  0.6  0.133333333333333  0.0
148  0.6  0.2  0.0
149  0.6  0.266666666666667  0.0
150  0.6  0.333333333333333  0.0
151  0.6  0.4  0.0
152  0.6  0.466666666666667  0.0
153  0.6  0.533333333333333  0.0
154  0.6  0.6  0.0
155  0.6  0.666666666666667  0.0
156  0.6  0.733333333333333  0.0
157  0.6  0.8  0.0
158  0.6  0.866666666666667  0.0
159  0.6  0.933333333333333  0.0
160  0.6  1.0  0.0
161  0.666666666666667  0.0  0.0
162  0.666666666666667  0.066666666666667  0.0
163  0.666666666666667  0.133333333333333  0.0
164  0.666666666666667  0.2  0.0
165  0.666666666666667  0.266666666666667  0.0
166  0.666666666666667  0.333333333333333  0.0
167  0.666666666666667  0.4  0.0
168  0.666666666666667  0.466666666666667  0.0
169  0.666666666666667  0.533333333333333  0.0
170  0.666666666666667  0.6  0.0
171  0.666666666666667  0.666666666666667  0.0
172  0.666666666666667  0.733333333333333  0.0
173  0.666666666666667  0.8  0.0
174  0.666666666666667  0.866666666666667  0.0
175  0.666666666666667  0.933333333333333  0.0
176  0.666666666666667  1.0  0.0
177  0.733333333333333  0.0  0.0
178  0.733333333333333  0.066666666666667  0.0
179  0.733333333333333  0.133333333333333  0.0
180  0.733333333333333  0.2  0.0
181  0.733333333333333  0.266666666666667  0.0
182  0.733333333333333  0.333333333333333  0.0
183  0.733333333333333  0.4  0.0
184  0.733333333333333  0.466666666666667  0.0
185  0.733333333333333  0.533333333333333  0.0
186  0.733333333333333  0.6  0.0
187  0.733333333333333  0.666666666666667  0.0
188  0.733333333333333  0.733333333333333  0.0
189  0.733333333333333  0.8  0.0
190  0.733333333333333  0.866666666666667  0.0
191  0.733333333333333  0.933333333333333  0.0
192  0.733333333333333  1.0  0.0
193  0.8  0.0  0.0
194  0.8  0.066666666666667  0.0
195  0.8  0.133333333333333  0.0
196  0.8  0.2  0.0
197  0.8  0.266666666666667  0.0
198  0.8  0.333333333333333  0.0
199  0.8  0.4  0.0
200  0.8  0.466666666666667  0.0
201  0.8  0.533333333333333  0.0
202  0.8  0.6  0.0
203  0.8  0.666666666666667  0.0
204  0.8  0.733333333333333  0.0
205  0.8  0.8  0.0
206  0.8  0.866666666666667  0.0
207  0.8  0.933333333333333  0.0
208  0.8  1.0  0.0
209  0.866666666666667  0.0  0.0
210  0.866666666666667  0.066666666666667  0.0
211  0.866666666666667  0.133333333333333  0.0
212  0.866666666666667  0.2  0.0
213  0.866666666666667  0.266666666666667  0.0
214  0.866666666666667  0.333333333333333  0.0
215  0.866666666666667  0.4  0.0
216  0.866666666666667  0.466666666666667  0.0
217  0.866666666666667  0.533333333333333  0.0
218  0.866666666666667  0.6  0.0
219  0.866666666666667  0.666666666666667  0.0
220  0.866666666666667  0.733333333333333  0.0
221  0.866666666666667  0.8  0.0
222  0.866666666666667  0.866666666666667  0.0
223  0.866666666666667  0.933333333333333  0.0
224  0.866666666666667  1.0  0.0
225  0.933333333333333  0.0  0.0
226  0.933333333333333  0.066666666666667  0.0
227  0.933333333333333  0.133333333333333  0.0
228  0.933333333333333  0.2  0.0
229  0.933333333333333  0.266666666666667  0.0
230  0.933333333333333  0.333333333333333  0.0
231  0.933333333333333  0.4  0.0
232  0.933333333333333  0.466666666666667  0.0
233  0.933333333333333  0.533333333333333  0.0
234  0.933333333333333  0.6  0.0
235  0.933333333333333  0.666666666666667  0.0
236  0.933333333333333  0.733333333333333  0.0
237  0.933333333333333  0.8  0.0
238  0.933333333333333  0.866666666666667  0.0
239  0.933333333333333  0.933333333333333  0.0
240  0.933333333333333  1.0  0.0
241  1.0  0.0  0.0
242  1.0  0.066666666666667  0.0
243  1.0  0.133333333333333  0.0
244  1.0  0.2  0.0
245  1.0  0.266666666666667  0.0
246  1.0  0.333333333333333  0.0
247  1.0  0.4  0.0
248  1.0  0.466666666666667  0.0
249  1.0  0.533333333333333  0.0
250  1.0  0.6  0.0
251  1.0  0.666666666666667  0.0
252  1.0  0.733333333333333  0.0
253  1.0  0.8  0.0
254  1.0  0.866666666666667  0.0
255  1.0  0.933333333333333  0.0
256  1.0  1.0  0.0

[1D Elements]
#ElemNr  ElemType  NrOfNodes  Level
#Node1 Node2 ... NodeNrOfNodes

[2D Elements]
#ElemNr  ElemType  NrOfNodes  Level
#Node1 Node2 ... NodeNrOfNodes
1 6 4 mech
1 17 18 2
2 6 4 mech
2 18 19 3
3 6 4 mech
3 19 20 4
4 6 4 mech
4 20 21 5
5 6 4 mech
5 21 22 6
6 6 4 mech
6 22 23 7
7 6 4 mech
7 23 24 8
8 6 4 mech
8 24 25 9
9 6 4 mech
9 25 26 10
10 6 4 mech
10 26 27 11
11 6 4 mech
11 27 28 12
12 6 4 mech
12 28 29 13
13 6 4 mech
13 29 30 14
14 6 4 mech
14 30 31 15
15 6 4 mech
15 31 32 16
16 6 4 mech
17 33 34 18
17 6 4 mech
18 34 35 19
18 6 4 mech
19 35 36 20
19 6 4 mech
20 36 37 21
20 6 4 mech
21 37 38 22
21 6 4 mech
22 38 39 23
22 6 4 mech
23 39 40 24
23 6 4 mech
24 40 41 25
24 6 4 mech
25 41 42 26
25 6 4 mech
26 42 43 27
26 6 4 mech
27 43 44 28
27 6 4 mech
28 44 45 29
28 6 4 mech
29 45 46 30
29 6 4 mech
30 46 47 31
30 6 4 mech
31 47 48 32
31 6 4 mech
33 49 50 34
32 6 4 mech
34 50 51 35
33 6 4 mech
35 51 52 36
34 6 4 mech
36 52 53 37
35 6 4 mech
37 53 54 38
36 6 4 mech
38 54 55 39
37 6 4 mech
39 55 56 40
38 6 4 mech
40 56 57 41
39 6 4 mech
41 57 58 42
40 6 4 mech
42 58 59 43
41 6 4 mech
43 59 60 44
42 6 4 mech
44 60 61 45
43 6 4 mech
45 61 62 46
44 6 4 mech
46 62 63 47
45 6 4 mech
47 63 64 48
46 6 4 mech
49 65 66 50
47 6 4 mech
50 66 67 51
48 6 4 mech
51 67 68 52
49 6 4 mech
52 68 69 53
50 6 4 mech
53 69 70 54
51 6 4 inclusion
54 70 71 55
52 6 4 inclusion
55 71 72 56
53 6 4 inclusion
56 72 73 57
54 6 4 inclusion
57 73 74 58
55 6 4 inclusion
58 74 75 59
56 6 4 mech
59 75 76 60
57 6 4 mech
60 76 77 61
58 6 4 mech
61 77 78 62
59 6 4 mech
62 78 79 63
60 6 4 mech
63 79 80 64
61 6 4 mech
65 81 82 66
62 6 4 mech
66 82 83 67
63 6 4 mech
67 83 84 68
64 6 4 mech
68 84 85 69
65 6 4 inclusion
69 85 86 70
66 6 4 inclusion
70 86 87 71
67 6 4 inclusion
71 87 88 72
68 6 4 inclusion
72 88 89 73
69 6 4 inclusion
73 89 90 74
70 6 4 inclusion
74 90 91 75
71 6 4 inclusion
75 91 92 76
72 6 4 mech
76 92 93 77
73 6 4 mech
77 93 94 78
74 6 4 mech
78 94 95 79
75 6 4 mech
79 95 96 80
76 6 4 mech
81 97 98 82
77 6 4 mech
82 98 99 83
78 6 4 mech
83 99 100 84
79 6 4 inclusion
84 100 101 85
80 6 4 inclusion
85 101 102 86
81 6 4 inclusion
86 102 103 87
82 6 4 inclusion
87 103 104 88
83 6 4 inclusion
88 104 105 89
84 6 4 inclusion
89 105 106 90
85 6 4 inclusion
90 106 107 91
86 6 4 inclusion
91 107 108 92
87 6 4 inclusion
92 108 109 93
88 6 4 mech
93 109 110 94
89 6 4 mech
94 110 111 95
90 6 4 mech
95 111 112 96
91 6 4 mech
97 113 114 98
92 6 4 mech
98 114 115 99
93 6 4 mech
99 115 116 100
94 6 4 inclusion
100 116 117 101
95 6 4 inclusion
101 117 118 102
96 6 4 inclusion
102 118 119 103
97 6 4 inclusion
103 119 120 104
98 6 4 inclusion
104 120 121 105
99 6 4 inclusion
105 121 122 106
100 6 4 inclusion
106 122 123 107
101 6 4 inclusion
107 123 124 108
102 6 4 inclusion
108 124 125 109
103 6 4 mech
109 125 126 110
104 6 4 mech
110 126 127 111
105 6 4 mech
111 127 128 112
106 6 4 mech
113 129 130 114
107 6 4 mech
114 130 131 115
108 6 4 mech
115 131 132 116
109 6 4 inclusion
116 132 133 117
110 6 4 inclusion
117 133 134 118
111 6 4 inclusion
118 134 135 119
112 6 4 inclusion
119 135 136 120
113 6 4 inclusion
120 136 137 121
114 6 4 inclusion
121 137 138 122
115 6 4 inclusion
122 138 139 123
116 6 4 inclusion
123 139 140 124
117 6 4 inclusion
124 140 141 125
118 6 4 mech
125 141 142 126
119 6 4 mech
126 142 143 127
120 6 4 mech
127 143 144 128
121 6 4 mech
129 145 146 130
122 6 4 mech
130 146 147 131
123 6 4 mech
131 147 148 132
124 6 4 inclusion
132 148 149 133
125 6 4 inclusion
133 149 150 134
126 6 4 inclusion
134 150 151 135
127 6 4 inclusion
135 151 152 136
128 6 4 inclusion
136 152 153 137
129 6 4 inclusion
137 153 154 138
130 6 4 inclusion
138 154 155 139
131 6 4 inclusion
139 155 156 140
132 6 4 inclusion
140 156 157 141
133 6 4 mech
141 157 158 142
134 6 4 mech
142 158 159 143
135 6 4 mech
143 159 160 144
136 6 4 mech
145 161 162 146
137 6 4 mech
146 162 163 147
138 6 4 mech
147 163 164 148
139 6 4 inclusion
148 164 165 149
140 6 4 inclusion
149 165 166 150
141 6 4 inclusion
150 166 167 151
142 6 4 inclusion
151 167 168 152
143 6 4 inclusion
152 168 169 153
144 6 4 inclusion
153 169 170 154
145 6 4 inclusion
154 170 171 155
146 6 4 inclusion
155 171 172 156
147 6 4 inclusion
156 172 173 157
148 6 4 mech
157 173 174 158
149 6 4 mech
158 174 175 159
150 6 4 mech
159 175 176 160
151 6 4 mech
161 177 178 162
152 6 4 mech
162 178 179 163
153 6 4 mech
163 179 180 164
154 6 4 mech
164 180 181 165
155 6 4 inclusion
165 181 182 166
156 6 4 inclusion
166 182 183 167
157 6 4 inclusion
167 183 184 168
158 6 4 inclusion
168 184 185 169
159 6 4 inclusion
169 185 186 170
160 6 4 inclusion
170 186 187 171
161 6 4 inclusion
171 187 188 172
162 6 4 mech
172 188 189 173
163 6 4 mech
173 189 190 174
164 6 4 mech
174 190 191 175
165 6 4 mech
175 191 192 176
166 6 4 mech
177 193 194 178
167 6 4 mech
178 194 195 179
168 6 4 mech
179 195 196 180
169 6 4 mech
180 196 197 181
170 6 4 mech
181 197 198 182
171 6 4 inclusion
182 198 199 183
172 6 4 inclusion
183 199 200 184
173 6 4 inclusion
184 200 201 185
174 6 4 inclusion
185 201 202 186
175 6 4 inclusion
186 202 203 187
176 6 4 mech
187 203 204 188
177 6 4 mech
188 204 205 189
178 6 4 mech
189 205 206 190
179 6 4 mech
190 206 207 191
180 6 4 mech
191 207 208 192
181 6 4 mech
193 209 210 194
182 6 4 mech
194 210 211 195
183 6 4 mech
195 211 212 196
184 6 4 mech
196 212 213 197
185 6 4 mech
197 213 214 198
186 6 4 mech
198 214 215 199
187 6 4 mech
199 215 216 200
188 6 4 mech
200 216 217 201
189 6 4 mech
201 217 218 202
190 6 4 mech
202 218 219 203
191 6 4 mech
203 219 220 204
192 6 4 mech
204 220 221 205
193 6 4 mech
205 221 222 206
194 6 4 mech
206 222 223 207
195 6 4 mech
207 223 224 208
196 6 4 mech
209 225 226 210
197 6 4 mech
210 226 227 211
198 6 4 mech
211 227 228 212
199 6 4 mech
212 228 229 213
200 6 4 mech
213 229 230 214
201 6 4 mech
214 230 231 215
202 6 4 mech
215 231 232 216
203 6 4 mech
216 232 233 217
204 6 4 mech
217 233 234 218
205 6 4 mech
218 234 235 219
206 6 4 mech
219 235 236 220
207 6 4 mech
220 236 237 221
208 6 4 mech
221 237 238 222
209 6 4 mech
222 238 239 223
210 6 4 mech
223 239 240 224
211 6 4 mech
225 241 242 226
212 6 4 mech
226 242 243 227
213 6 4 mech
227 243 244 228
214 6 4 mech
228 244 245 229
215 6 4 mech
229 245 246 230
216 6 4 mech
230 246 247 231
217 6 4 mech
231 247 248 232
218 6 4 mech
232 248 249 233
219 6 4 mech
233 249 250 234
220 6 4 mech
234 250 251 235
221 6 4 mech
235 251 252 236
222 6 4 mech
236 252 253 237
223 6 4 mech
237 253 254 238
224 6 4 mech
238 254 255 239
225 6 4 mech
239 255 256 240

[3D Elements]
#ElemNr  ElemType  NrOfNodes  Level
#Node1 Node2 ... NodeNrOfNodes

[Node BC]
#NodeNr Level
1 south
17 south
33 south
49 south
65 south
81 south
97 south
113 south
129 south
145 south
161 south
177 south
193 south
209 south
225 south
241 south
16 north
32 north
48 north
64 north
80 north
96 north
112 north
128 north
144 north
160 north
176 north
192 north
208 north
224 north
240 north
256 north
1 west
2 west
3 west
4 west
5 west
6 west
7 west
8 west
9 west
10 west
11 west
12 west
13 west
14 west
15 west
16 west
241 east
242 east
243 east
244 east
245 east
246 east
247 east
248 east
249 east
250 east
251 east
252 east
253 east
254 east
255 east
256 east
1 south_west
241 south_east
16 north_west
256 north_east
55 inclusion_nodes
56 inclusion_nodes
57 inclusion_nodes
58 inclusion_nodes
70 inclusion_nodes
75 inclusion_nodes
85 inclusion_nodes
92 inclusion_nodes
100 inclusion_nodes
109 inclusion_nodes
116 inclusion_nodes
125 inclusion_nodes
132 inclusion_nodes
141 inclusion_nodes
148 inclusion_nodes
157 inclusion_nodes
165 inclusion_nodes
172 inclusion_nodes
182 inclusion_nodes
187 inclusion_nodes
199 inclusion_nodes
200 inclusion_nodes
201 inclusion_nodes
202 inclusion_nodes
1 outer_nodes
2 outer_nodes
3 outer_nodes
4 outer_nodes
5 outer_nodes
6 outer_nodes
7 outer_nodes
8 outer_nodes
9 outer_nodes
10 outer_nodes
11 outer_nodes
12 outer_nodes
13 outer_nodes
14 outer_nodes
15 outer_nodes
16 outer_nodes
17 outer_nodes
32 outer_nodes
33 outer_nodes
48 outer_nodes
49 outer_nodes
64 outer_nodes
65 outer_nodes
80 outer_nodes
81 outer_nodes
96 outer_nodes
97 outer_nodes
112 outer_nodes
113 outer_nodes
128 outer_nodes
129 outer_nodes
144 outer_nodes
145 outer_nodes
160 outer_nodes
161 outer_nodes
176 outer_nodes
177 outer_nodes
192 outer_nodes
193 outer_nodes
208 outer_nodes
209 outer_nodes
224 outer_nodes
225 outer_nodes
240 outer_nodes
241 outer_nodes
242 outer_nodes
243 outer_nodes
244 outer_nodes
245 outer_nodes
246 outer_nodes
247 outer_nodes
248 outer_nodes
249 outer_nodes
250 outer_nodes
251 outer_nodes
252 outer_nodes
253 outer_nodes
254 outer_nodes
255 outer_nodes
256 outer_nodes

[Save Nodes]
#NodeNr Level

[Save Elements]
#ElemNr Level

 
