$MeshFormat
2.2 0 8
$EndMeshFormat
$PhysicalNames
5
2 1 "hot"
2 2 "cold"
2 3 "meas"
3 4 "vWire1"
3 5 "vWire2"
$EndPhysicalNames
$Nodes
117
1 0 0 0
2 0 1 0
3 1 1 0
4 1 0 0
5 0 1 20
6 1 1 20
7 1 0 20
8 0 0 20
9 0 1 30
10 1 1 30
11 1 0 30
12 0 0 30
13 0.5857864138644628 1 0
14 1 0.5939027642556909 0
15 0.4305009092843567 0 0
16 0 0.4494897791063232 0
17 0.5857864138644628 1 20
18 1 0.5939027642556909 20
19 0.4305009092843567 0 20
20 0 0.4494897791063232 20
21 0 1 3.333333333333333
22 0 1 6.666666666666666
23 0 1 10
24 0 1 13.33333333333333
25 0 1 16.66666666666667
26 1 1 3.333333333333333
27 1 1 6.666666666666666
28 1 1 10
29 1 1 13.33333333333333
30 1 1 16.66666666666667
31 1 0 3.333333333333333
32 1 0 6.666666666666666
33 1 0 10
34 1 0 13.33333333333333
35 1 0 16.66666666666667
36 0 0 3.333333333333333
37 0 0 6.666666666666666
38 0 0 10
39 0 0 13.33333333333333
40 0 0 16.66666666666667
41 0.5857864138644628 1 30
42 1 0.5939027642556909 30
43 0.4305009092843567 0 30
44 0 0.4494897791063232 30
45 0 1 21.66666666666667
46 0 1 23.33333333333333
47 0 1 25
48 0 1 26.66666666666667
49 0 1 28.33333333333333
50 1 1 21.66666666666667
51 1 1 23.33333333333333
52 1 1 25
53 1 1 26.66666666666667
54 1 1 28.33333333333333
55 1 0 21.66666666666667
56 1 0 23.33333333333333
57 1 0 25
58 1 0 26.66666666666667
59 1 0 28.33333333333333
60 0 0 21.66666666666667
61 0 0 23.33333333333333
62 0 0 25
63 0 0 26.66666666666667
64 0 0 28.33333333333333
65 0.5025024737797003 0.5073923651990925 0
66 0.5857864138644628 1 3.333333333333333
67 0.5857864138644628 1 6.666666666666666
68 0.5857864138644628 1 10
69 0.5857864138644628 1 13.33333333333333
70 0.5857864138644628 1 16.66666666666667
71 1 0.5939027642556909 3.333333333333333
72 1 0.5939027642556909 6.666666666666666
73 1 0.5939027642556909 10
74 1 0.5939027642556909 13.33333333333333
75 1 0.5939027642556909 16.66666666666667
76 0.4305009092843567 0 3.333333333333333
77 0.4305009092843567 0 6.666666666666666
78 0.4305009092843567 0 10
79 0.4305009092843567 0 13.33333333333333
80 0.4305009092843567 0 16.66666666666667
81 0 0.4494897791063232 3.333333333333333
82 0 0.4494897791063232 6.666666666666666
83 0 0.4494897791063232 10
84 0 0.4494897791063232 13.33333333333333
85 0 0.4494897791063232 16.66666666666667
86 0.5025024737797003 0.5073923651990925 20
87 0.5857864138644628 1 21.66666666666667
88 0.5857864138644628 1 23.33333333333333
89 0.5857864138644628 1 25
90 0.5857864138644628 1 26.66666666666667
91 0.5857864138644628 1 28.33333333333333
92 1 0.5939027642556909 21.66666666666667
93 1 0.5939027642556909 23.33333333333333
94 1 0.5939027642556909 25
95 1 0.5939027642556909 26.66666666666667
96 1 0.5939027642556909 28.33333333333333
97 0.4305009092843567 0 21.66666666666667
98 0.4305009092843567 0 23.33333333333333
99 0.4305009092843567 0 25
100 0.4305009092843567 0 26.66666666666667
101 0.4305009092843567 0 28.33333333333333
102 0 0.4494897791063232 21.66666666666667
103 0 0.4494897791063232 23.33333333333333
104 0 0.4494897791063232 25
105 0 0.4494897791063232 26.66666666666667
106 0 0.4494897791063232 28.33333333333333
107 0.5025024737797003 0.5073923651990925 30
108 0.5025024737797003 0.5073923651990925 3.333333333333333
109 0.5025024737797003 0.5073923651990925 6.666666666666666
110 0.5025024737797003 0.5073923651990925 10
111 0.5025024737797003 0.5073923651990925 13.33333333333333
112 0.5025024737797003 0.5073923651990925 16.66666666666667
113 0.5025024737797003 0.5073923651990925 21.66666666666667
114 0.5025024737797003 0.5073923651990925 23.33333333333333
115 0.5025024737797003 0.5073923651990925 25
116 0.5025024737797003 0.5073923651990925 26.66666666666667
117 0.5025024737797003 0.5073923651990925 28.33333333333333
$EndNodes
$Elements
60
1 3 2 2 6 14 4 15 65
2 3 2 2 6 13 65 16 2
3 3 2 2 6 65 15 1 16
4 3 2 2 6 65 13 3 14
5 3 2 3 28 18 7 19 86
6 3 2 3 28 17 86 20 5
7 3 2 3 28 86 19 8 20
8 3 2 3 28 86 17 6 18
9 3 2 1 50 42 11 43 107
10 3 2 1 50 41 107 44 9
11 3 2 1 50 107 43 12 44
12 3 2 1 50 107 41 10 42
13 5 2 4 1 15 4 14 65 76 31 71 108
14 5 2 4 1 76 31 71 108 77 32 72 109
15 5 2 4 1 77 32 72 109 78 33 73 110
16 5 2 4 1 78 33 73 110 79 34 74 111
17 5 2 4 1 79 34 74 111 80 35 75 112
18 5 2 4 1 80 35 75 112 19 7 18 86
19 5 2 4 1 16 65 13 2 81 108 66 21
20 5 2 4 1 81 108 66 21 82 109 67 22
21 5 2 4 1 82 109 67 22 83 110 68 23
22 5 2 4 1 83 110 68 23 84 111 69 24
23 5 2 4 1 84 111 69 24 85 112 70 25
24 5 2 4 1 85 112 70 25 20 86 17 5
25 5 2 4 1 1 15 65 16 36 76 108 81
26 5 2 4 1 36 76 108 81 37 77 109 82
27 5 2 4 1 37 77 109 82 38 78 110 83
28 5 2 4 1 38 78 110 83 39 79 111 84
29 5 2 4 1 39 79 111 84 40 80 112 85
30 5 2 4 1 40 80 112 85 8 19 86 20
31 5 2 4 1 3 13 65 14 26 66 108 71
32 5 2 4 1 26 66 108 71 27 67 109 72
33 5 2 4 1 27 67 109 72 28 68 110 73
34 5 2 4 1 28 68 110 73 29 69 111 74
35 5 2 4 1 29 69 111 74 30 70 112 75
36 5 2 4 1 30 70 112 75 6 17 86 18
37 5 2 5 2 19 7 18 86 97 55 92 113
38 5 2 5 2 97 55 92 113 98 56 93 114
39 5 2 5 2 98 56 93 114 99 57 94 115
40 5 2 5 2 99 57 94 115 100 58 95 116
41 5 2 5 2 100 58 95 116 101 59 96 117
42 5 2 5 2 101 59 96 117 43 11 42 107
43 5 2 5 2 20 86 17 5 102 113 87 45
44 5 2 5 2 102 113 87 45 103 114 88 46
45 5 2 5 2 103 114 88 46 104 115 89 47
46 5 2 5 2 104 115 89 47 105 116 90 48
47 5 2 5 2 105 116 90 48 106 117 91 49
48 5 2 5 2 106 117 91 49 44 107 41 9
49 5 2 5 2 8 19 86 20 60 97 113 102
50 5 2 5 2 60 97 113 102 61 98 114 103
51 5 2 5 2 61 98 114 103 62 99 115 104
52 5 2 5 2 62 99 115 104 63 100 116 105
53 5 2 5 2 63 100 116 105 64 101 117 106
54 5 2 5 2 64 101 117 106 12 43 107 44
55 5 2 5 2 6 17 86 18 50 87 113 92
56 5 2 5 2 50 87 113 92 51 88 114 93
57 5 2 5 2 51 88 114 93 52 89 115 94
58 5 2 5 2 52 89 115 94 53 90 116 95
59 5 2 5 2 53 90 116 95 54 91 117 96
60 5 2 5 2 54 91 117 96 10 41 107 42
$EndElements
