#1:iter	2:compliance	3:duration	4:max_abs_sumModuli_(allDesigns)	5:infeas_count_sumModuli_(allDesigns)	6:volume_(density)	7:max_abs_slope_(rotAngle)	8:infeas_count_slope_(rotAngle)
0 	0.906542 	0.204 	15.0001 	130 	0.6 	0.17453 	28
1 	0.906542 	0.031 	15.0001 	130 	0.6 	0.17453 	28
2 	1.18291 	0.04 	15 	133 	0.6 	0.17453 	46
3 	0.906231 	0.032 	15.0001 	130 	0.6 	0.17453 	28
4 	1.08737 	0.024 	15.0002 	134 	0.6 	0.17453 	53
5 	0.90598 	0.041 	15.0001 	130 	0.6 	0.17453 	28
6 	0.905339 	0.043 	15 	133 	0.6 	0.17453 	30
7 	0.90442 	0.045 	15 	133 	0.6 	0.17453 	31
8 	0.90421 	0.059 	15 	133 	0.6 	0.17453 	29
