
0                         0
2.0000000000000003E-6     1.921355911192461E-5
4.000000000000001E-6      3.8009369963553155E-5
6.0E-6                    5.638916536397149E-5
8.000000000000001E-6      7.435465060728282E-5
1.0E-5                    9.190750295179764E-5
1.2E-5                    1.0904937111096527E-4
1.4000000000000001E-5     1.257818747559974E-4
1.6000000000000003E-5     1.421066040301385E-4
1.8000000000000004E-5     1.5802511907453515E-4
2.0E-5                    1.7353894956566058E-4
2.2E-5                    1.88649594264249E-4
2.4E-5                    2.0335852057569827E-4
2.6000000000000002E-5     2.1766716412191875E-4
2.8000000000000003E-5     2.3157692832448875E-4
3.0000000000000008E-5     2.4508918399925126E-4
3.2000000000000005E-5     2.582052689621552E-4
3.4000000000000007E-5     2.709264876463751E-4
3.600000000000001E-5      2.832541107306539E-4
3.8E-5                    2.951893747788407E-4
4.0E-5                    3.067334818905774E-4
4.2E-5                    3.178875993631015E-4
4.4E-5                    3.2865285936413446E-4
4.6E-5                    3.3903035861582197E-4
4.8E-5                    3.4902115808969095E-4
5.0E-5                    3.586262827125941E-4
5.2000000000000004E-5     3.67846721083612E-4
5.4000000000000005E-5     3.766834252019209E-4
5.6000000000000006E-5     3.851373102054047E-4
5.800000000000001E-5      3.9320925412039356E-4
6.0000000000000015E-5     4.0090009762206477E-4
6.200000000000002E-5      4.082106438057187E-4
6.400000000000001E-5      4.151416579688537E-4
6.600000000000002E-5      4.2169386740401824E-4
6.800000000000001E-5      4.2786796120241E-4
7.0E-5                    4.3366459006822047E-4
7.200000000000002E-5      4.3908436614368217E-4
7.4E-5                    4.441278628448163E-4
7.6E-5                    4.4879561470786544E-4
7.800000000000001E-5      4.53088117246372E-4
8.0E-5                    4.570058268189206E-4
8.200000000000001E-5      4.60549160507509E-4
8.4E-5                    4.6371849600653284E-4
8.600000000000002E-5      4.665141715223839E-4
8.8E-5                    4.6893648568364633E-4
9.000000000000002E-5      4.709856974618756E-4
9.2E-5                    4.7266202610296034E-4
9.4E-5                    4.739656510690584E-4
9.6E-5                    4.7489671199109704E-4
9.8E-5                    4.7545530863183055E-4
1.0E-4                    4.7564150085946497E-4
