^C:\USERS\VANYA\SOURCE\REPOS\OCLAB1\PROCESSARRAY_TEST\PCH.CPP
/c /I"C:\PROGRAM FILES (X86)\MICROSOFT VISUAL STUDIO\2019\COMMUNITY\VC\UNITTEST\INCLUDE" /I"C:\DEV\CPP\VCPKG\INSTALLED\X86-WINDOWS\INCLUDE" /ZI /JMC /nologo /W3 /WX- /diagnostics:column /sdl /Od /Oy- /D WIN32 /D _DEBUG /D _WINDLL /D _UNICODE /D UNICODE /Gm- /EHsc /RTC1 /MDd /GS /fp:precise /Zc:wchar_t /Zc:forScope /Zc:inline /Yc"pch.h" /Fp"DEBUG\PROCESSARRAY_TEST.PCH" /Fo"DEBUG\\" /Fd"DEBUG\VC142.PDB" /external:W3 /Gd /TP /analyze- /FC C:\USERS\VANYA\SOURCE\REPOS\OCLAB1\PROCESSARRAY_TEST\PCH.CPP
^C:\USERS\VANYA\SOURCE\REPOS\OCLAB1\PROCESSARRAY_TEST\PROCESSARRAY_TEST.CPP
/c /I"C:\PROGRAM FILES (X86)\MICROSOFT VISUAL STUDIO\2019\COMMUNITY\VC\UNITTEST\INCLUDE" /I"C:\DEV\CPP\VCPKG\INSTALLED\X86-WINDOWS\INCLUDE" /ZI /JMC /nologo /W3 /WX- /diagnostics:column /sdl /Od /Oy- /D WIN32 /D _DEBUG /D _WINDLL /D _UNICODE /D UNICODE /Gm- /EHsc /RTC1 /MDd /GS /fp:precise /Zc:wchar_t /Zc:forScope /Zc:inline /Yu"pch.h" /Fp"DEBUG\PROCESSARRAY_TEST.PCH" /Fo"DEBUG\\" /Fd"DEBUG\VC142.PDB" /external:W3 /Gd /TP /analyze- /FC C:\USERS\VANYA\SOURCE\REPOS\OCLAB1\PROCESSARRAY_TEST\PROCESSARRAY_TEST.CPP
