^C:\Users\vanya\source\repos\oclab1\processArray_test\processArray_test.vcxproj
C:\Users\vanya\source\repos\oclab1\Debug\processArray_test.lib
C:\Users\vanya\source\repos\oclab1\Debug\processArray_test.exp
^C:\Users\vanya\source\repos\oclab1\processArray_test\processArray_test.vcxproj
C:\Users\vanya\source\repos\oclab1\Debug\processArray_test.lib
C:\Users\vanya\source\repos\oclab1\Debug\processArray_test.exp
^C:\Users\vanya\source\repos\oclab1\processArray_test\processArray_test.vcxproj
C:\Users\vanya\source\repos\oclab1\Debug\processArray_test.lib
C:\Users\vanya\source\repos\oclab1\Debug\processArray_test.exp
^C:\Users\vanya\source\repos\oclab1\processArray_test\processArray_test.vcxproj
C:\Users\vanya\source\repos\oclab1\Debug\processArray_test.lib
C:\Users\vanya\source\repos\oclab1\Debug\processArray_test.exp
^C:\Users\vanya\source\repos\oclab1\processArray_test\processArray_test.vcxproj
C:\Users\vanya\source\repos\oclab1\Debug\processArray_test.lib
C:\Users\vanya\source\repos\oclab1\Debug\processArray_test.exp
^C:\Users\vanya\source\repos\oclab1\processArray_test\processArray_test.vcxproj
C:\Users\vanya\source\repos\oclab1\Debug\processArray_test.lib
C:\Users\vanya\source\repos\oclab1\Debug\processArray_test.exp
