^C:\USERS\VANYA\SOURCE\REPOS\KOLOK1_OC\KOLOK1_OC\SOURCE.CPP
C:\USERS\VANYA\SOURCE\REPOS\KOLOK1_OC\KOLOK1_OC\X64\DEBUG\VC143.PDB
C:\USERS\VANYA\SOURCE\REPOS\KOLOK1_OC\KOLOK1_OC\X64\DEBUG\VC143.IDB
C:\USERS\VANYA\SOURCE\REPOS\KOLOK1_OC\KOLOK1_OC\X64\DEBUG\SOURCE.OBJ
^C:\USERS\VANYA\SOURCE\REPOS\KOLOK1_OC\KOLOK1_OC\SOURCE.CPP
C:\USERS\VANYA\SOURCE\REPOS\KOLOK1_OC\KOLOK1_OC\X64\DEBUG\VC143.PDB
C:\USERS\VANYA\SOURCE\REPOS\KOLOK1_OC\KOLOK1_OC\X64\DEBUG\VC143.IDB
C:\USERS\VANYA\SOURCE\REPOS\KOLOK1_OC\KOLOK1_OC\X64\DEBUG\TEST.OBJ
C:\USERS\VANYA\SOURCE\REPOS\KOLOK1_OC\KOLOK1_OC\X64\DEBUG\SOURCE.OBJ
