^C:\USERS\VANYA\SOURCE\REPOS\KOLOK1_MATRIX_OC\KOLOK1_MATRIX_OC\X64\DEBUG\SOURCE.OBJ
C:\USERS\VANYA\SOURCE\REPOS\KOLOK1_MATRIX_OC\X64\DEBUG\KOLOK1_MATRIX_OC.EXE
C:\USERS\VANYA\SOURCE\REPOS\KOLOK1_MATRIX_OC\KOLOK1_MATRIX_OC\X64\DEBUG\KOLOK1_MATRIX_OC.ILK
C:\USERS\VANYA\SOURCE\REPOS\KOLOK1_MATRIX_OC\X64\DEBUG\KOLOK1_MATRIX_OC.PDB
