^C:\USERS\VANYA\SOURCE\REPOS\OCLAB2\OCLAB2\SOURCE.CPP
C:\USERS\VANYA\SOURCE\REPOS\OCLAB2\OCLAB2\DEBUG\VC142.PDB
C:\USERS\VANYA\SOURCE\REPOS\OCLAB2\OCLAB2\DEBUG\VC142.IDB
C:\USERS\VANYA\SOURCE\REPOS\OCLAB2\OCLAB2\DEBUG\SOURCE.OBJ
