^C:\USERS\VANYA\SOURCE\REPOS\OCLAB4_2\OCLAB4_2\SOURCE.CPP
C:\USERS\VANYA\SOURCE\REPOS\OCLAB4_2\OCLAB4_2\DEBUG\VC142.PDB
C:\USERS\VANYA\SOURCE\REPOS\OCLAB4_2\OCLAB4_2\DEBUG\VC142.IDB
C:\USERS\VANYA\SOURCE\REPOS\OCLAB4_2\OCLAB4_2\DEBUG\SOURCE.OBJ
