^C:\USERS\VANYA\SOURCE\REPOS\OCLAB1\OCLAB1\DEBUG\SOURCE.OBJ
C:\USERS\VANYA\SOURCE\REPOS\OCLAB1\DEBUG\OCLAB1.EXE
C:\USERS\VANYA\SOURCE\REPOS\OCLAB1\OCLAB1\DEBUG\OCLAB1.ILK
C:\USERS\VANYA\SOURCE\REPOS\OCLAB1\DEBUG\OCLAB1.PDB
