<?xml version="1.0" encoding="utf-8"?>
<!-- Generator: Adobe Illustrator 23.0.6, SVG Export Plug-In . SVG Version: 6.00 Build 0)  -->
<svg version="1.1" id="Layer_1" xmlns="http://www.w3.org/2000/svg" xmlns:xlink="http://www.w3.org/1999/xlink" x="0px" y="0px"
	 viewBox="0 0 29.48 28.75" style="enable-background:new 0 0 29.48 28.75;" xml:space="preserve">
<style type="text/css">
	.st0{fill:#414042;}
</style>
<g>
	<path class="st0" d="M14.74,0.01C6.6,0.01,0,6.61,0,14.75c0,6.51,4.22,12.04,10.08,13.99c0.74,0.14,1.01-0.32,1.01-0.71
		c0-0.35-0.01-1.51-0.02-2.74c-4.1,0.89-4.97-1.74-4.97-1.74c-0.67-1.7-1.64-2.16-1.64-2.16c-1.34-0.91,0.1-0.9,0.1-0.9
		c1.48,0.1,2.26,1.52,2.26,1.52c1.31,2.25,3.45,1.6,4.29,1.23c0.13-0.95,0.51-1.6,0.94-1.97c-3.27-0.37-6.72-1.64-6.72-7.28
		c0-1.61,0.58-2.92,1.52-3.96C6.7,9.65,6.19,8.15,6.99,6.12c0,0,1.24-0.4,4.05,1.51c1.18-0.33,2.44-0.49,3.69-0.5
		c1.25,0.01,2.51,0.17,3.69,0.5c2.81-1.91,4.05-1.51,4.05-1.51c0.8,2.03,0.3,3.53,0.14,3.9c0.95,1.03,1.52,2.35,1.52,3.96
		c0,5.66-3.45,6.91-6.73,7.27c0.53,0.46,1,1.35,1,2.73c0,1.97-0.02,3.56-0.02,4.04c0,0.39,0.27,0.85,1.01,0.71
		c5.85-1.95,10.07-7.47,10.07-13.98C29.48,6.61,22.88,0.01,14.74,0.01z"/>
	<path class="st0" d="M5.58,21.17c-0.03,0.07-0.15,0.1-0.25,0.05C5.22,21.17,5.16,21.07,5.2,21c0.03-0.08,0.15-0.1,0.25-0.05
		C5.56,21,5.62,21.1,5.58,21.17L5.58,21.17z M5.4,21.04"/>
	<path class="st0" d="M6.18,21.84c-0.07,0.07-0.21,0.03-0.3-0.07c-0.1-0.1-0.11-0.24-0.04-0.31c0.07-0.07,0.21-0.03,0.3,0.07
		C6.23,21.64,6.25,21.77,6.18,21.84L6.18,21.84z M6.04,21.69"/>
	<path class="st0" d="M6.76,22.69c-0.09,0.06-0.24,0-0.33-0.13c-0.09-0.13-0.09-0.29,0-0.35c0.09-0.06,0.24-0.01,0.33,0.12
		C6.85,22.47,6.85,22.63,6.76,22.69L6.76,22.69z M6.76,22.69"/>
	<path class="st0" d="M7.56,23.51c-0.08,0.09-0.25,0.07-0.38-0.06c-0.13-0.12-0.16-0.29-0.08-0.38c0.08-0.09,0.26-0.06,0.38,0.06
		C7.6,23.25,7.64,23.42,7.56,23.51L7.56,23.51z M7.56,23.51"/>
	<path class="st0" d="M8.65,23.99c-0.04,0.12-0.2,0.17-0.37,0.12c-0.17-0.05-0.28-0.19-0.24-0.3c0.03-0.12,0.2-0.17,0.37-0.12
		C8.58,23.73,8.69,23.87,8.65,23.99L8.65,23.99z M8.65,23.99"/>
	<path class="st0" d="M9.86,24.07c0,0.12-0.14,0.22-0.31,0.22c-0.18,0-0.32-0.09-0.32-0.21c0-0.12,0.14-0.22,0.31-0.23
		C9.72,23.86,9.86,23.95,9.86,24.07L9.86,24.07z M9.86,24.07"/>
	<path class="st0" d="M10.98,23.88c0.02,0.12-0.1,0.24-0.27,0.27c-0.17,0.03-0.33-0.04-0.35-0.16c-0.02-0.12,0.1-0.24,0.27-0.27
		C10.8,23.69,10.96,23.76,10.98,23.88L10.98,23.88z M10.98,23.88"/>
</g>
</svg>
