{
  "can_push": true,
  "commit": {
    "author_email": "brad.king@kitware.com",
    "author_name": "Brad King",
    "authored_date": "2018-07-12T08:50:24.000-04:00",
    "committed_date": "2018-07-12T08:50:24.000-04:00",
    "committer_email": "brad.king@kitware.com",
    "committer_name": "Brad King",
    "created_at": "2018-07-12T08:50:24.000-04:00",
    "id": "e59db4b129b29df220ecec6119ed2130207a0397",
    "message": "cargo: prep for 0.1100.1\n",
    "parent_ids": [
      "5c81cc05661dcbb5fd923cca093920816c21ef7e"
    ],
    "short_id": "e59db4b1",
    "title": "cargo: prep for 0.1100.1",
    "web_url": "https://gitlab.kitware.com/utils/rust-gitlab/-/commit/e59db4b129b29df220ecec6119ed2130207a0397"
  },
  "default": true,
  "developers_can_merge": false,
  "developers_can_push": false,
  "merged": false,
  "name": "master",
  "protected": true,
  "web_url": "https://gitlab.kitware.com/utils/rust-gitlab/-/tree/master"
}
