{
  "attachment": null,
  "author": {
    "avatar_url": "https://secure.gravatar.com/avatar/0617392a2f9fd505720d0c42cefc1a10?s=80&d=identicon",
    "id": 10,
    "name": "Brad King",
    "state": "active",
    "username": "brad.king",
    "web_url": "https://gitlab.kitware.com/brad.king"
  },
  "body": "resolved all threads",
  "commands_changes": {},
  "confidential": false,
  "created_at": "2019-08-29T17:31:17.886Z",
  "id": 619275,
  "noteable_id": 20215,
  "noteable_iid": 35,
  "noteable_type": "MergeRequest",
  "resolvable": false,
  "system": true,
  "type": null,
  "updated_at": "2019-08-29T17:31:17.889Z"
}
