{
  "author": {
    "avatar_url": "https://secure.gravatar.com/avatar/2f5f7e99190174edb5a2f66b8653b0b2?s=80&d=identicon",
    "id": 13,
    "name": "Ben Boeckel",
    "state": "active",
    "username": "ben.boeckel",
    "web_url": "https://gitlab.kitware.com/ben.boeckel"
  },
  "created_at": "2016-12-07T16:28:33.966Z",
  "line": null,
  "line_type": null,
  "note": "Example commit note for data fetching.",
  "path": null
}
