{
    "InputFeatureNum" : 1,
    "InputWidth" : 416,
    "InputHeight" : 416,
    "OutFeatureNum" : 1,
    "OutFeatureWidth" : 52,
    "OutFeatureHeight" : 52,
    "OutFeatureChannel" : 19,
    
    "ncnn" : {
        "InputFeatureIndex" : 0,
        "OutFeatureIndex" : 48,
        "InputFeatureName" : "data",
        "OutFeatureName" : "prob_cls",
        "WeightPath" : "ncnn.bin",
        "ParamPath" : "ncnn.weight",
        "Means" : [0.0, 0.0, 0.0],
        "Norms" : [0.00392, 0.00392, 0.00392],
        "Format": "RGB"
    },
    "mnn" : {
        "Format": "BGR",
        "ModelPath": "345000_frozen.mnn",
        "Means": [0.0, 0.0, 0.0],
        "Norms": [1.0, 1.0, 1.0],
        "Encrypted" : 0,
        "InputFeatureName" : "image",
        "OutFeatureName" : "pre3dbbox"
    },
    "coreml" : {
          "bEncrypted" : 0,
          "Orientation" : 0,
          "MlmodelcPath" : "changan3_h.mlmodelc",
          "InputFeatureName" : "image",
          "OutFeatureName" : "bbox"
    }
}





