%YAML 1.1
%TAG !u! tag:unity3d.com,2011:
--- !u!74 &7400000
AnimationClip:
  m_ObjectHideFlags: 0
  m_CorrespondingSourceObject: {fileID: 0}
  m_PrefabInstance: {fileID: 0}
  m_PrefabAsset: {fileID: 0}
  m_Name: txt_Loop
  serializedVersion: 6
  m_Legacy: 0
  m_Compressed: 0
  m_UseHighQualityCurve: 1
  m_RotationCurves: []
  m_CompressedRotationCurves: []
  m_EulerCurves: []
  m_PositionCurves: []
  m_ScaleCurves: []
  m_FloatCurves: []
  m_PPtrCurves:
  - curve:
    - time: 0
      value: {fileID: 21300196, guid: 3cd85e44c62421b469919ee6826d1a41, type: 3}
    - time: 0.033333335
      value: {fileID: 21300198, guid: 3cd85e44c62421b469919ee6826d1a41, type: 3}
    - time: 0.06666667
      value: {fileID: 21300200, guid: 3cd85e44c62421b469919ee6826d1a41, type: 3}
    - time: 0.1
      value: {fileID: 21300202, guid: 3cd85e44c62421b469919ee6826d1a41, type: 3}
    - time: 0.13333334
      value: {fileID: 21300204, guid: 3cd85e44c62421b469919ee6826d1a41, type: 3}
    - time: 0.16666667
      value: {fileID: 21300206, guid: 3cd85e44c62421b469919ee6826d1a41, type: 3}
    - time: 0.2
      value: {fileID: 21300208, guid: 3cd85e44c62421b469919ee6826d1a41, type: 3}
    - time: 0.23333333
      value: {fileID: 21300210, guid: 3cd85e44c62421b469919ee6826d1a41, type: 3}
    - time: 0.26666668
      value: {fileID: 21300212, guid: 3cd85e44c62421b469919ee6826d1a41, type: 3}
    - time: 0.3
      value: {fileID: 21300214, guid: 3cd85e44c62421b469919ee6826d1a41, type: 3}
    - time: 0.33333334
      value: {fileID: 21300216, guid: 3cd85e44c62421b469919ee6826d1a41, type: 3}
    - time: 0.36666667
      value: {fileID: 21300218, guid: 3cd85e44c62421b469919ee6826d1a41, type: 3}
    - time: 0.4
      value: {fileID: 21300220, guid: 3cd85e44c62421b469919ee6826d1a41, type: 3}
    - time: 0.43333334
      value: {fileID: 21300222, guid: 3cd85e44c62421b469919ee6826d1a41, type: 3}
    - time: 0.46666667
      value: {fileID: 21300224, guid: 3cd85e44c62421b469919ee6826d1a41, type: 3}
    - time: 0.5
      value: {fileID: 21300226, guid: 3cd85e44c62421b469919ee6826d1a41, type: 3}
    - time: 0.53333336
      value: {fileID: 21300228, guid: 3cd85e44c62421b469919ee6826d1a41, type: 3}
    - time: 0.5666667
      value: {fileID: 21300230, guid: 3cd85e44c62421b469919ee6826d1a41, type: 3}
    - time: 0.6000001
      value: {fileID: 21300232, guid: 3cd85e44c62421b469919ee6826d1a41, type: 3}
    - time: 0.63333344
      value: {fileID: 21300234, guid: 3cd85e44c62421b469919ee6826d1a41, type: 3}
    - time: 0.6666668
      value: {fileID: 21300236, guid: 3cd85e44c62421b469919ee6826d1a41, type: 3}
    - time: 0.70000017
      value: {fileID: 21300238, guid: 3cd85e44c62421b469919ee6826d1a41, type: 3}
    - time: 0.7333335
      value: {fileID: 21300240, guid: 3cd85e44c62421b469919ee6826d1a41, type: 3}
    - time: 0.7666669
      value: {fileID: 21300242, guid: 3cd85e44c62421b469919ee6826d1a41, type: 3}
    - time: 0.80000025
      value: {fileID: 21300244, guid: 3cd85e44c62421b469919ee6826d1a41, type: 3}
    - time: 0.8333336
      value: {fileID: 21300246, guid: 3cd85e44c62421b469919ee6826d1a41, type: 3}
    - time: 0.866667
      value: {fileID: 21300248, guid: 3cd85e44c62421b469919ee6826d1a41, type: 3}
    - time: 0.90000033
      value: {fileID: 21300250, guid: 3cd85e44c62421b469919ee6826d1a41, type: 3}
    - time: 0.9333337
      value: {fileID: 21300252, guid: 3cd85e44c62421b469919ee6826d1a41, type: 3}
    - time: 0.96666706
      value: {fileID: 21300254, guid: 3cd85e44c62421b469919ee6826d1a41, type: 3}
    - time: 1.0000004
      value: {fileID: 21300256, guid: 3cd85e44c62421b469919ee6826d1a41, type: 3}
    - time: 1.0333337
      value: {fileID: 21300258, guid: 3cd85e44c62421b469919ee6826d1a41, type: 3}
    - time: 1.066667
      value: {fileID: 21300260, guid: 3cd85e44c62421b469919ee6826d1a41, type: 3}
    - time: 1.1000003
      value: {fileID: 21300262, guid: 3cd85e44c62421b469919ee6826d1a41, type: 3}
    - time: 1.1333336
      value: {fileID: 21300264, guid: 3cd85e44c62421b469919ee6826d1a41, type: 3}
    - time: 1.1666669
      value: {fileID: 21300266, guid: 3cd85e44c62421b469919ee6826d1a41, type: 3}
    - time: 1.2000002
      value: {fileID: 21300268, guid: 3cd85e44c62421b469919ee6826d1a41, type: 3}
    - time: 1.2333335
      value: {fileID: 21300270, guid: 3cd85e44c62421b469919ee6826d1a41, type: 3}
    - time: 1.2666668
      value: {fileID: 21300272, guid: 3cd85e44c62421b469919ee6826d1a41, type: 3}
    - time: 1.3000001
      value: {fileID: 21300274, guid: 3cd85e44c62421b469919ee6826d1a41, type: 3}
    - time: 1.3333334
      value: {fileID: 21300276, guid: 3cd85e44c62421b469919ee6826d1a41, type: 3}
    - time: 1.3666667
      value: {fileID: 21300278, guid: 3cd85e44c62421b469919ee6826d1a41, type: 3}
    - time: 1.4
      value: {fileID: 21300280, guid: 3cd85e44c62421b469919ee6826d1a41, type: 3}
    - time: 1.4333333
      value: {fileID: 21300282, guid: 3cd85e44c62421b469919ee6826d1a41, type: 3}
    - time: 1.4666666
      value: {fileID: 21300284, guid: 3cd85e44c62421b469919ee6826d1a41, type: 3}
    - time: 1.4999999
      value: {fileID: 21300286, guid: 3cd85e44c62421b469919ee6826d1a41, type: 3}
    - time: 1.5333332
      value: {fileID: 21300288, guid: 3cd85e44c62421b469919ee6826d1a41, type: 3}
    - time: 1.5666665
      value: {fileID: 21300290, guid: 3cd85e44c62421b469919ee6826d1a41, type: 3}
    - time: 1.5999998
      value: {fileID: 21300292, guid: 3cd85e44c62421b469919ee6826d1a41, type: 3}
    attribute: m_Sprite
    path: 
    classID: 114
    script: {fileID: 11500000, guid: fe87c0e1cc204ed48ad3b37840f39efc, type: 3}
  m_SampleRate: 30
  m_WrapMode: 0
  m_Bounds:
    m_Center: {x: 0, y: 0, z: 0}
    m_Extent: {x: 0, y: 0, z: 0}
  m_ClipBindingConstant:
    genericBindings:
    - serializedVersion: 2
      path: 0
      attribute: 2015549526
      script: {fileID: 11500000, guid: fe87c0e1cc204ed48ad3b37840f39efc, type: 3}
      typeID: 114
      customType: 0
      isPPtrCurve: 1
    pptrCurveMapping:
    - {fileID: 21300196, guid: 3cd85e44c62421b469919ee6826d1a41, type: 3}
    - {fileID: 21300198, guid: 3cd85e44c62421b469919ee6826d1a41, type: 3}
    - {fileID: 21300200, guid: 3cd85e44c62421b469919ee6826d1a41, type: 3}
    - {fileID: 21300202, guid: 3cd85e44c62421b469919ee6826d1a41, type: 3}
    - {fileID: 21300204, guid: 3cd85e44c62421b469919ee6826d1a41, type: 3}
    - {fileID: 21300206, guid: 3cd85e44c62421b469919ee6826d1a41, type: 3}
    - {fileID: 21300208, guid: 3cd85e44c62421b469919ee6826d1a41, type: 3}
    - {fileID: 21300210, guid: 3cd85e44c62421b469919ee6826d1a41, type: 3}
    - {fileID: 21300212, guid: 3cd85e44c62421b469919ee6826d1a41, type: 3}
    - {fileID: 21300214, guid: 3cd85e44c62421b469919ee6826d1a41, type: 3}
    - {fileID: 21300216, guid: 3cd85e44c62421b469919ee6826d1a41, type: 3}
    - {fileID: 21300218, guid: 3cd85e44c62421b469919ee6826d1a41, type: 3}
    - {fileID: 21300220, guid: 3cd85e44c62421b469919ee6826d1a41, type: 3}
    - {fileID: 21300222, guid: 3cd85e44c62421b469919ee6826d1a41, type: 3}
    - {fileID: 21300224, guid: 3cd85e44c62421b469919ee6826d1a41, type: 3}
    - {fileID: 21300226, guid: 3cd85e44c62421b469919ee6826d1a41, type: 3}
    - {fileID: 21300228, guid: 3cd85e44c62421b469919ee6826d1a41, type: 3}
    - {fileID: 21300230, guid: 3cd85e44c62421b469919ee6826d1a41, type: 3}
    - {fileID: 21300232, guid: 3cd85e44c62421b469919ee6826d1a41, type: 3}
    - {fileID: 21300234, guid: 3cd85e44c62421b469919ee6826d1a41, type: 3}
    - {fileID: 21300236, guid: 3cd85e44c62421b469919ee6826d1a41, type: 3}
    - {fileID: 21300238, guid: 3cd85e44c62421b469919ee6826d1a41, type: 3}
    - {fileID: 21300240, guid: 3cd85e44c62421b469919ee6826d1a41, type: 3}
    - {fileID: 21300242, guid: 3cd85e44c62421b469919ee6826d1a41, type: 3}
    - {fileID: 21300244, guid: 3cd85e44c62421b469919ee6826d1a41, type: 3}
    - {fileID: 21300246, guid: 3cd85e44c62421b469919ee6826d1a41, type: 3}
    - {fileID: 21300248, guid: 3cd85e44c62421b469919ee6826d1a41, type: 3}
    - {fileID: 21300250, guid: 3cd85e44c62421b469919ee6826d1a41, type: 3}
    - {fileID: 21300252, guid: 3cd85e44c62421b469919ee6826d1a41, type: 3}
    - {fileID: 21300254, guid: 3cd85e44c62421b469919ee6826d1a41, type: 3}
    - {fileID: 21300256, guid: 3cd85e44c62421b469919ee6826d1a41, type: 3}
    - {fileID: 21300258, guid: 3cd85e44c62421b469919ee6826d1a41, type: 3}
    - {fileID: 21300260, guid: 3cd85e44c62421b469919ee6826d1a41, type: 3}
    - {fileID: 21300262, guid: 3cd85e44c62421b469919ee6826d1a41, type: 3}
    - {fileID: 21300264, guid: 3cd85e44c62421b469919ee6826d1a41, type: 3}
    - {fileID: 21300266, guid: 3cd85e44c62421b469919ee6826d1a41, type: 3}
    - {fileID: 21300268, guid: 3cd85e44c62421b469919ee6826d1a41, type: 3}
    - {fileID: 21300270, guid: 3cd85e44c62421b469919ee6826d1a41, type: 3}
    - {fileID: 21300272, guid: 3cd85e44c62421b469919ee6826d1a41, type: 3}
    - {fileID: 21300274, guid: 3cd85e44c62421b469919ee6826d1a41, type: 3}
    - {fileID: 21300276, guid: 3cd85e44c62421b469919ee6826d1a41, type: 3}
    - {fileID: 21300278, guid: 3cd85e44c62421b469919ee6826d1a41, type: 3}
    - {fileID: 21300280, guid: 3cd85e44c62421b469919ee6826d1a41, type: 3}
    - {fileID: 21300282, guid: 3cd85e44c62421b469919ee6826d1a41, type: 3}
    - {fileID: 21300284, guid: 3cd85e44c62421b469919ee6826d1a41, type: 3}
    - {fileID: 21300286, guid: 3cd85e44c62421b469919ee6826d1a41, type: 3}
    - {fileID: 21300288, guid: 3cd85e44c62421b469919ee6826d1a41, type: 3}
    - {fileID: 21300290, guid: 3cd85e44c62421b469919ee6826d1a41, type: 3}
    - {fileID: 21300292, guid: 3cd85e44c62421b469919ee6826d1a41, type: 3}
  m_AnimationClipSettings:
    serializedVersion: 2
    m_AdditiveReferencePoseClip: {fileID: 0}
    m_AdditiveReferencePoseTime: 0
    m_StartTime: 0
    m_StopTime: 1.6333331
    m_OrientationOffsetY: 0
    m_Level: 0
    m_CycleOffset: 0
    m_HasAdditiveReferencePose: 0
    m_LoopTime: 1
    m_LoopBlend: 0
    m_LoopBlendOrientation: 0
    m_LoopBlendPositionY: 0
    m_LoopBlendPositionXZ: 0
    m_KeepOriginalOrientation: 0
    m_KeepOriginalPositionY: 1
    m_KeepOriginalPositionXZ: 0
    m_HeightFromFeet: 0
    m_Mirror: 0
  m_EditorCurves: []
  m_EulerEditorCurves: []
  m_HasGenericRootTransform: 0
  m_HasMotionFloatCurves: 0
  m_Events: []
