%YAML 1.1
%TAG !u! tag:unity3d.com,2011:
--- !u!21 &2100000
Material:
  serializedVersion: 8
  m_ObjectHideFlags: 0
  m_CorrespondingSourceObject: {fileID: 0}
  m_PrefabInstance: {fileID: 0}
  m_PrefabAsset: {fileID: 0}
  m_Name: AllIn_AllIn_FX_Hit
  m_Shader: {fileID: 4800000, guid: cd7cfcf6fcc4dfc46852145f52b1a816, type: 3}
  m_ValidKeywords: []
  m_InvalidKeywords: []
  m_LightmapFlags: 0
  m_EnableInstancingVariants: 0
  m_DoubleSidedGI: 0
  m_CustomRenderQueue: -1
  stringTagMap: {}
  disabledShaderPasses: []
  m_SavedProperties:
    serializedVersion: 3
    m_TexEnvs:
    - _texcoord:
        m_Texture: {fileID: 0}
        m_Scale: {x: 1, y: 1}
        m_Offset: {x: 0, y: 0}
    m_Ints: []
    m_Floats:
    - _Offset: 0
    - _Opacity: 0
    - _Smooth: 0.23
    - _Smoothness: 0.119
    - _Width: 0.17
    - __dirty: 0
    m_Colors:
    - _Color0: {r: 0.19339621, g: 0.99999964, b: 1, a: 0}
  m_BuildTextureStacks: []
