{
  "InputFeatureNum" : 1,
  "InputWidth" : 416,
  "InputHeight" : 416,
  "OutFeatureNum" : 1,
  "OutFeatureWidth" : 512,
  "OutFeatureHeight" : 512,
  "OutFeatureChannel" : 1,
  "mnn": {
    "Format": "BGR",
    "ModelPath": "detector.mnn",
    "InputFeatureName": "data",
    "OutFeatureName" : "output",
    "Means": [
      104.008,
      116.669,
      122.675
    ],
    "Norms": [
      1,
      1,
      1
    ],
    "Encrypted": 0,
    "ThreadNum": 2,
    "USE_GPU": 0
  },
  "coreml": {
    "bEncrypted": 0,
    "bDataType": 1,
    "MlmodelcPath": "detector.mlmodelc",
    "InputFeatureName": "images",
    "OutFeatureName": "var_1984"
  }
}




