{
  "detector": {
    "netInputW": 640,
    "netInputH": 640,
    "score_thresh": 0.45,
    "nms_thresh": 0.35,
    "strides": [8,16,32],
    "reg_max": 7,
    "max_person_detection": 10,
    "max_detect_distance": 5,
    "test_image": "ezxr_ezxr_single_person_outdoor_shengyu_03_000748.jpg"
  }
}