﻿[
  {
    "outputFileName": "wwwroot/css/flowbite.extensions.css",
    "inputFiles": [
      "wwwroot/css/bootstrap.css",
      "Components/**/*.css"
    ],
    "minify": {
      "enabled": false,
      "renameLocals": true
    }
  },
  {
    "outputFileName": "wwwroot/css/flowbite.extensions.min.css",
    "inputFiles": [
      "wwwroot/css/flowbite.extensions.css"
    ]
  }
]
