{
    "public/xenforge_replyalerter_box.html": {
        "version_id": 1000031,
        "version_string": "1.0.0 Alpha 1",
        "hash": "f37cfcbfd927183ae798b9a6f7ce329c"
    },
    "public/xenforge_replyalerter_theme.less": {
        "version_id": 1000031,
        "version_string": "1.0.0 Alpha 1",
        "hash": "186283f818ed3d34a251a03b0a5d4ffc"
    }
}