{
    "public/xenforge_replyalert_injection_less.json": {
        "hash": "944a79eea1442aa132f735eb23861ef5"
    },
    "public/xenforge_replyalerter_injection_box.json": {
        "hash": "1e7813036606aab7bd10eb458626474f"
    }
}