{
	"agentes": [
		{
			"agId": "plane1",
			"domainPath": "/media/leonardo/DADOS/Mestrado/Dropbox/LeonardoMoreira-PPGInf/Dissertação/inputs/Evaluation/zenotravel/domainZenoTravel.pddl",
			"problemPath":"/media/leonardo/DADOS/Mestrado/Dropbox/LeonardoMoreira-PPGInf/Dissertação/inputs/Evaluation/zenotravel/2agentes/plane1.pddl"
		},
		{
			"agId": "plane2",
			"domainPath": "/media/leonardo/DADOS/Mestrado/Dropbox/LeonardoMoreira-PPGInf/Dissertação/inputs/Evaluation/zenotravel/domainZenoTravel.pddl",
			"problemPath":"/media/leonardo/DADOS/Mestrado/Dropbox/LeonardoMoreira-PPGInf/Dissertação/inputs/Evaluation/zenotravel/2agentes/plane2.pddl"
		}
		
	]
}