{
	"agentes": [
		{
			"agId": "satellite0",
			"domainPath": "/media/leonardo/DADOS/Mestrado/Dropbox/LeonardoMoreira-PPGInf/Dissertação/inputs/Evaluation/satellite/domainSatellite.pddl",
			"problemPath":"/media/leonardo/DADOS/Mestrado/Dropbox/LeonardoMoreira-PPGInf/Dissertação/inputs/Evaluation/satellite/2agentes/p0.pddl"
		},
		{
			"agId": "satellite1",
			"domainPath": "/media/leonardo/DADOS/Mestrado/Dropbox/LeonardoMoreira-PPGInf/Dissertação/inputs/Evaluation/satellite/domainSatellite.pddl",
			"problemPath":"/media/leonardo/DADOS/Mestrado/Dropbox/LeonardoMoreira-PPGInf/Dissertação/inputs/Evaluation/satellite/2agentes/p1.pddl"
		}

		
	]
}